Bicyclo[2.2.1]hept-2-ene,5-bromo-,endo-
- Formula: C7H9Br
- Molecular weight: 173.050
- IUPAC Standard InChIKey: DWPPXNJBRSZQHD-KPGICGJXSA-N
- CAS Registry Number: 5810-82-2
- Chemical structure:
View 3d structure (requires JavaScript / HTML 5) - Stereoisomers:

Gas phase ion energetics data

Data compiled by: Sharon G. Lias, Rhoda D. Levin, and Sherif A. Kafafi
Ionization energy determinations
IE (eV) | Method | Reference |
---|---|---|
9.2 | EI | Tomer, Turk, et al., 1972 |
Appearance energy determinations
Ion | AE (eV) | Other Products | Method | Reference | Comment |
---|---|---|---|---|---|
C5H6+ | 10.0 | C2H3Br | EI | Tomer, Turk, et al., 1972 | |
C7H9+ | 10.1 | Br | EI | Tomer, Turk, et al., 1972 |

References

Tomer, Turk, et al., 1972
Tomer, K.B.; Turk, J.; Shapiro, R.H.,
Anchimeric assistance in electron-impact reactions: Homoallylic systems,
Org. Mass Spectrom., 1972, 6, 235. [all data]