(1,1'-Biphenyl)-2,2'-dicarboxylic acid, dimethyl ester
- Formula: C16H14O4
- Molecular weight: 270.2800
- IUPAC Standard InChIKey: CGTYPNOFVGYUED-UHFFFAOYSA-N
- CAS Registry Number: 5807-64-7
- Chemical structure:
View 3d structure (requires JavaScript / HTML 5) - Permanent link for this species. Use this link for bookmarking this species for future reference.

Gas phase ion energetics data

Data compiled by: Sharon G. Lias, Rhoda D. Levin, and Sherif A. Kafafi
Ionization energy determinations
IE (eV) | Method | Reference |
---|---|---|
8.90 ± 0.05 | EI | Loudon and Mazengo, 1974 |

References

Loudon and Mazengo, 1974
Loudon, A.G.; Mazengo, R.Z.,
Steric strain and electron-impact. The behaviour of some n, n'-dimethyl- 1,1-binaphthyls, some n, n'-dimethylbiphenyls and model compounds,
Org. Mass Spectrom., 1974, 8, 179. [all data]