[2.2.2](1,2,4)Cyclophane
- Formula: C18H18
- Molecular weight: 234.3355
- IUPAC Standard InChIKey: APDVWYTWRPQAFD-UHFFFAOYSA-N
- CAS Registry Number: 58002-98-5
- Chemical structure:
View 3d structure (requires JavaScript / HTML 5) - Permanent link for this species. Use this link for bookmarking this species for future reference.

Gas phase ion energetics data

Data compiled as indicated in comments:
LLK - Sharon G. Lias, Rhoda D. Levin, and Sherif A. Kafafi
Ionization energy determinations
IE (eV) | Method | Reference | Comment |
---|---|---|---|
7.8 | PE | Kovac, Mohraz, et al., 1980 | LLK |
8.0 ± 0.1 | PE | Kovac, Mohraz, et al., 1980 | Vertical value; LLK |

References

Kovac, Mohraz, et al., 1980
Kovac, B.; Mohraz, M.; Heilbronner, E.; Boekelheide, V.; Hopf, H.,
Photoelectron spectra of the cyclophanes,
J. Am. Chem. Soc., 1980, 102, 4314. [all data]