4,5-Dipropyl-4-octene
- Formula: C14H28
- Molecular weight: 196.3721
- IUPAC Standard InChIKey: JPEJJWOTBXVQJJ-UHFFFAOYSA-N
- CAS Registry Number: 57984-32-4
- Chemical structure:
View 3d structure (requires JavaScript / HTML 5) - Permanent link for this species. Use this link for bookmarking this species for future reference.

Gas phase ion energetics data

Data compiled by: Sharon G. Lias, John E. Bartmess, Joel F. Liebman, John L. Holmes, Rhoda D. Levin, and W. Gary Mallard
Ionization energy determinations
IE (eV) | Method | Reference | Comment |
---|---|---|---|
8.11 ± 0.02 | PE | Brown, Buschek, et al., 1983 | Vertical value |

References

Brown, Buschek, et al., 1983
Brown, R.S.; Buschek, J.M.; Kopecky, K.R.; Miller, A.J.,
Photoelectron spectra of syn- and anti-sesquinorbornene. Evidence for vertical Σ-π delocalization in bicyclo[2.2.1]heptene,
J. Org. Chem., 1983, 48, 3692. [all data]