Benz[a]anthracene, 7,12-dimethyl-
- Formula: C20H16
- Molecular weight: 256.3410
- IUPAC Standard InChIKey: ARSRBNBHOADGJU-UHFFFAOYSA-N
- CAS Registry Number: 57-97-6
- Chemical structure:
View 3d structure (requires JavaScript / HTML 5) - Other names: DMBA; 7,12-Dimethyl-1,2-benzanthracene; 7,12-Dimethylbenzanthracene; 7,12-Dimethylbenzo[a]anthracene; 7,12-Dimethylbenz[a]anthracene; 7,12-DMBA; 9,10-Dimethyl-1,2-benzanthracene; 9,10-Dimethylbenz[a]anthracene; Benz(a)anthracene, 9,10-dimethyl-; NCI-C03918; 1,4-Dimethyl-2,3-benzphenanthrene; 6,7-Dimethyl-1,2-benzanthracene; 9,10-Dimethyl-1,2-benzanthrazen; NSC 408823

Gas phase ion energetics data

Data compiled as indicated in comments:
LLK - Sharon G. Lias, Rhoda D. Levin, and Sherif A. Kafafi
RDSH - Henry M. Rosenstock, Keith Draxl, Bruce W. Steiner, and John T. Herron
Ionization energy determinations
IE (eV) | Method | Reference | Comment |
---|---|---|---|
7.10 ± 0.03 | PE | Akiyama, Harvey, et al., 1981 | LLK |
7.43 | CTS | Birks and Stifkin, 1961 | RDSH |

Van Den Dool and Kratz RI, non-polar column, temperature ramp

Column type | Active phase | I | Reference | Comment |
---|---|---|---|---|
Capillary | SE-52 | 2711. | Beernaert, 1979 | He, 50. C @ 5. min, 6. K/min; Column length: 33.3 m; Column diameter: 0.50 mm; Tend: 320. C |
Capillary | SE-52 | 2713. | Carugno and Rossi, 1967 | N2, 1.8 K/min; Column length: 65. m; Column diameter: 0.3 mm; Tstart: 100. C; Tend: 300. C |

Lee's RI, non-polar column, temperature ramp

Column type | Active phase | I | Reference | Comment |
---|---|---|---|---|
Capillary | DB-5MS | 443.90 | Chen, Keeran, et al., 2002 | 30. m/0.25 mm/0.5 μm, 40. C @ 1. min, 4. K/min; Tend: 310. C |
Capillary | DB-5MS | 443.82 | Chen, Keeran, et al., 2002 | 30. m/0.25 mm/0.5 μm, 40. C @ 1. min, 4. K/min; Tend: 310. C |
Capillary | SE-54 | 444.00 | Guillén, Blanco, et al., 1989 | 20. m/0.22 mm/0.20 μm, He, 4. K/min; Tstart: 50. C; Tend: 300. C |
Capillary | SE-52 | 443.38 | Lee, Vassilaros, et al., 1979 | 12. m/0.3 mm/0.34 μm, He, 2. K/min; Tstart: 50. C; Tend: 250. C |

Lee's RI, non-polar column, custom temperature program

Column type | Active phase | I | Reference | Comment |
---|---|---|---|---|
Capillary | SE-52 | 442.03 | Shlyakhov, 1984 | Program: not specified |
Capillary | SE-52 | 443.38 | Shlyakhov, 1984 | Program: not specified |
Capillary | SE-52 | 444.84 | Shlyakhov, 1984 | Program: not specified |

References

Akiyama, Harvey, et al., 1981
Akiyama, I.; Harvey, R.G.; LeBreton, P.R.,
Ultraviolet photoelectron studies of methyl-substituted benz[a]anthracenes,
J. Am. Chem. Soc., 1981, 103, 6330. [all data]
Birks and Stifkin, 1961
Birks, J.B.; Stifkin, M.A.,
π-Electronic excitation and ionization energies of condensed ring aromatic hydrocarbons,
Nature, 1961, 191, 761. [all data]
Beernaert, 1979
Beernaert, H.,
Gas Chromatographic Analysis of Polyclylic Aromatic Hydrocarbons,
J. Chromatogr., 1979, 173, 1, 109-118, https://doi.org/10.1016/S0021-9673(01)80450-7
. [all data]
Carugno and Rossi, 1967
Carugno, N.; Rossi, S.,
Evaluation of polynuclear hydrocarbons in cigarette smoke by glass capillary columns,
J. Gas Chromatogr., 1967, 5, 2, 103-106, https://doi.org/10.1093/chromsci/5.2.103
. [all data]
Chen, Keeran, et al., 2002
Chen, P.H.; Keeran, W.S.; Van Ausdale, W.A.; Schindler, D.R.; Roberts, D.W.,
Application of Lee retention indices to the confirmation of tentatively identified compounds from GC/MS analysis of environmental samples, Technical paper, Analytical Services Division, Environmental ScienceEngineering, Inc, PO Box 1703, Gainesville, FL 32602, 2002, 11. [all data]
Guillén, Blanco, et al., 1989
Guillén, M.D.; Blanco, J.; Bermejo, J.; Blanco, C.G.,
Temperature programmed retention indices of some PAHs on Capillary columns coated with OV-1701 and SE-54,
J. Hi. Res. Chromatogr., 1989, 12, 8, 552-554, https://doi.org/10.1002/jhrc.1240120816
. [all data]
Lee, Vassilaros, et al., 1979
Lee, M.L.; Vassilaros, D.L.; White, C.M.; Novotny, M.,
Retention Indices for Programmed-Temperature Capillary-Column Gas Chromatography of Polycyclic Aromatic Hydrocarbons,
Anal. Chem., 1979, 51, 6, 768-773, https://doi.org/10.1021/ac50042a043
. [all data]
Shlyakhov, 1984
Shlyakhov, A.F.,
Gas chromatography in organic geochemistry, Nedra, Moscow, 1984, 221. [all data]