Benzenamine, 2,6-diethyl-
- Formula: C10H15N
- Molecular weight: 149.2328
- IUPAC Standard InChIKey: FOYHNROGBXVLLX-UHFFFAOYSA-N
- CAS Registry Number: 579-66-8
- Chemical structure:
View 3d structure (requires JavaScript / HTML 5) - Other names: Aniline, 2,6-diethyl-; 2,6-Diethylaniline; 2,6-Diethylbenzenamine; 2,6-diethylaniline (DEA)

Phase change data

Data compiled as indicated in comments:
BS - Robert L. Brown and Stephen E. Stein
AC - William E. Acree, Jr., James S. Chickos
Quantity | Value | Units | Method | Reference | Comment |
---|---|---|---|---|---|
ΔvapH° | 65.9 ± 0.6 | kJ/mol | N/A | Verevkin, 2000 | AC |
Reduced pressure boiling point
Tboil (K) | Pressure (bar) | Reference | Comment |
---|---|---|---|
387.2 | 0.013 | Aldrich Chemical Company Inc., 1990 | BS |
Enthalpy of vaporization
ΔvapH (kJ/mol) | Temperature (K) | Reference | Comment |
---|---|---|---|
69.5 ± 0.6 | 306. | Verevkin, 2000 | Based on data from 284. to 328. K.; AC |

Gas phase ion energetics data

Data compiled as indicated in comments:
LBLHLM - Sharon G. Lias, John E. Bartmess, Joel F. Liebman, John L. Holmes, Rhoda D. Levin, and W. Gary Mallard
Ionization energy determinations
IE (eV) | Method | Reference | Comment |
---|---|---|---|
7.77 | PE | Rozeboom, Houk, et al., 1982 | Vertical value; LBLHLM |

Van Den Dool and Kratz RI, non-polar column, temperature ramp

Column type | Active phase | I | Reference | Comment |
---|---|---|---|---|
Capillary | OV-1 | 1295.6 | Gautzsch and Zinn, 1996 | 8. K/min; Tstart: 35. C; Tend: 300. C |

Normal alkane RI, non-polar column, temperature ramp

Column type | Active phase | I | Reference | Comment |
---|---|---|---|---|
Capillary | Durabond-5 | 1329. | Pereira, Rostad, et al., 1990 | 30. m/0.25 mm/0.25 μm, Helium, 50. C @ 4. min, 6. K/min; Tend: 300. C |

Lee's RI, non-polar column, temperature ramp

Column type | Active phase | I | Reference | Comment |
---|---|---|---|---|
Capillary | Durabond-5 | 227.43 | Pereira, Rostad, et al., 1990 | 30. m/0.25 mm/0.25 μm, Helium, 50. C @ 4. min, 6. K/min; Tend: 300. C |

References

Verevkin, 2000
Verevkin, Sergey P.,
Thermochemical study of the ortho interactions in alkyl substituted anilines,
The Journal of Chemical Thermodynamics, 2000, 32, 2, 247-259, https://doi.org/10.1006/jcht.1999.0587
. [all data]
Aldrich Chemical Company Inc., 1990
Aldrich Chemical Company Inc.,
Catalog Handbook of Fine Chemicals, Aldrich Chemical Company, Inc., Milwaukee WI, 1990, 1. [all data]
Rozeboom, Houk, et al., 1982
Rozeboom, M.D.; Houk, K.N.; Searles, S.; Seyedrezai, S.E.,
Photoelectron spectroscopy of N-aryl cyclic amines. Variable conformations and relationships to gas- and solution-phase basicities,
J. Am. Chem. Soc., 1982, 104, 3448. [all data]
Gautzsch and Zinn, 1996
Gautzsch, R.; Zinn, P.,
Use of incremental models to estimate the retention indexes of aromatic compounds,
Chromatographia, 1996, 43, 3/4, 163-176, https://doi.org/10.1007/BF02292946
. [all data]
Pereira, Rostad, et al., 1990
Pereira, W.E.; Rostad, C.E.; Leiker, T.J.,
Determination of trace levels of herbicides and their degradation products in surface and ground waters by gas chromatography/ion trap mass spectrometry,
Anal. Chim. Acta, 1990, 228, 69-75, https://doi.org/10.1016/S0003-2670(00)80480-8
. [all data]