Acetamide, N-methyl-N-phenyl-
- Formula: C9H11NO
- Molecular weight: 149.1897
- IUPAC Standard InChIKey: LMTGCJANOQOGPI-UHFFFAOYSA-N
- CAS Registry Number: 579-10-2
- Chemical structure:
View 3d structure (requires JavaScript / HTML 5) - Other names: Acetanilide, N-methyl-; Acetomethylanilide; Exalgin; Methylantifebrin; Methylazol; N-Acetyl-N-methylaniline; N-Methyl-N-phenylacetamide; N-Methylacetanilide; Oxalgin; Phenylmethylacetamide; N-Acetyl-methylaniline; NSC 2140

Phase change data

Data compiled as indicated in comments:
AC - William E. Acree, Jr., James S. Chickos
Enthalpy of vaporization
ΔvapH (kJ/mol) | Temperature (K) | Method | Reference | Comment |
---|---|---|---|---|
60.1 | 398. | A | Stephenson and Malanowski, 1987 | Based on data from 383. to 519. K.; AC |
56.7 | 392. | N/A | Stull, 1947 | Based on data from 377. to 526. K.; AC |
Antoine Equation Parameters
log10(P) = A − (B / (T + C))
P = vapor pressure (bar)
T = temperature (K)
View plot Requires a JavaScript / HTML 5 canvas capable browser.
Temperature (K) | A | B | C | Reference | Comment |
---|---|---|---|---|---|
377.0 to 526. | 4.94761 | 2414.374 | -37.92 | Stull, 1947 | Coefficents calculated by NIST from author's data. |

Gas phase ion energetics data

Data compiled by: Sharon G. Lias, Rhoda D. Levin, and Sherif A. Kafafi
Ionization energy determinations
IE (eV) | Method | Reference | Comment |
---|---|---|---|
8.81 | PE | Nakagaki, Kobayashi, et al., 1980 | Vertical value |

Normal alkane RI, non-polar column, custom temperature program

Column type | Active phase | I | Reference | Comment |
---|---|---|---|---|
Capillary | Polydimethyl siloxanes | 1260. | Zenkevich and Chupalov, 1996 | Program: not specified |

References

Stephenson and Malanowski, 1987
Stephenson, Richard M.; Malanowski, Stanislaw,
Handbook of the Thermodynamics of Organic Compounds, 1987, https://doi.org/10.1007/978-94-009-3173-2
. [all data]
Stull, 1947
Stull, Daniel R.,
Vapor Pressure of Pure Substances. Organic and Inorganic Compounds,
Ind. Eng. Chem., 1947, 39, 4, 517-540, https://doi.org/10.1021/ie50448a022
. [all data]
Nakagaki, Kobayashi, et al., 1980
Nakagaki, R.; Kobayashi, T.; Nagakura, S.,
Conformations of acetanilide and related compounds studied by ultraviolet photoelectron spectroscopy,
Bull. Chem. Soc. Jpn., 1980, 53, 901. [all data]
Lang (editor), 1969
Lang (editor), L.,
Absorption Spectra in the Ultraviolet and Visible Region, 1969, 13, 31. [all data]
Zenkevich and Chupalov, 1996
Zenkevich, I.G.; Chupalov, A.A.,
New Possibilities of Chromato Mass Pectrometric Identification of Organic Compounds Using Increments of Gas Chromatographic Retention Indices of Molecular Structural Fragments,
Zh. Org. Khim. (Rus.), 1996, 32, 5, 656-666. [all data]