1,3,5,2,4-Oxathiazadiborolidine,2,4,5-trimethyl-
- Formula: C3H9B2NOS
- Molecular weight: 128.797
- IUPAC Standard InChIKey: PYPNWTZFUIUQQR-UHFFFAOYSA-N
- CAS Registry Number: 57877-90-4
- Chemical structure:
View 3d structure (requires JavaScript / HTML 5) - Permanent link for this species. Use this link for bookmarking this species for future reference.

Gas phase ion energetics data

Data compiled by: Sharon G. Lias, Rhoda D. Levin, and Sherif A. Kafafi
Ionization energy determinations
IE (eV) | Method | Reference | Comment |
---|---|---|---|
9.00 | PE | Kroner, Nolle, et al., 1975 | Vertical value |

References

Kroner, Nolle, et al., 1975
Kroner, J.; Nolle, D.; Noth, H.; Winterstein, W.,
Photoelektronenspektroskopische untersuchungen an bor-verbindungen, II funfgliedrige hetero - cyclen des bors,
Chem. Ber., 1975, 108, 3807. [all data]