1,3,4,2,5-Thiadiazadiborolidine,2,5-dimethyl-3-(trimethylsilyl)-
- Formula: C5H16B2N2SSi
- Molecular weight: 185.966
- IUPAC Standard InChIKey: FKPDZGFUZRTWSN-UHFFFAOYSA-N
- CAS Registry Number: 57877-86-8
- Chemical structure:
View 3d structure (requires JavaScript / HTML 5) - Permanent link for this species. Use this link for bookmarking this species for future reference.

Gas phase ion energetics data

Data compiled by: Sharon G. Lias, Rhoda D. Levin, and Sherif A. Kafafi
Ionization energy determinations
IE (eV) | Method | Reference | Comment |
---|---|---|---|
8.25 | PE | Kroner, Nolle, et al., 1975 | Vertical value |

References

Kroner, Nolle, et al., 1975
Kroner, J.; Nolle, D.; Noth, H.; Winterstein, W.,
Photoelektronenspektroskopische untersuchungen an bor-verbindungen, II funfgliedrige hetero - cyclen des bors,
Chem. Ber., 1975, 108, 3807. [all data]