Benzenamine, 2-ethyl-
- Formula: C8H11N
- Molecular weight: 121.1796
- IUPAC Standard InChIKey: MLPVBIWIRCKMJV-UHFFFAOYSA-N
- CAS Registry Number: 578-54-1
- Chemical structure:
View 3d structure (requires JavaScript / HTML 5) - Other names: Aniline, o-ethyl-; o-Aminoethylbenzene; o-Ethylaniline; 2-Ethylaniline; 2-Ethylbenzenamine; 2-Ethylbenzeneamine; ortho-Ethylaniline; Aniline, 2-ethyl-; UN 2273; 2-Ethylphenylamine; NSC 62014

Gas phase ion energetics data

Data compiled by: Henry M. Rosenstock, Keith Draxl, Bruce W. Steiner, and John T. Herron
Ionization energy determinations
IE (eV) | Method | Reference |
---|---|---|
7.6 ± 0.1 | CTS | Farrell and Newton, 1966 |

References

Farrell and Newton, 1966
Farrell, P.G.; Newton, J.,
Ionization potentials of primary aromatic amines and aza-hydrocarbons,
Tetrahedron Lett., 1966, 5517. [all data]