Chromium, bis(diphenyl ether)-
- Formula: C24H20CrO2
- Molecular weight: 392.4105
- IUPAC Standard InChIKey: GPZFPFMCDIODAR-UHFFFAOYSA-N
- CAS Registry Number: 57820-94-7
- Chemical structure:
View 3d structure (requires JavaScript / HTML 5) - Permanent link for this species. Use this link for bookmarking this species for future reference.

Gas phase ion energetics data

Data compiled by: Sharon G. Lias, John E. Bartmess, Joel F. Liebman, John L. Holmes, Rhoda D. Levin, and W. Gary Mallard
Ionization energy determinations
IE (eV) | Method | Reference | Comment |
---|---|---|---|
5.52 | PE | Cabelli, Cowley, et al., 1982 | Vertical value |

References

Cabelli, Cowley, et al., 1982
Cabelli, D.E.; Cowley, A.H.; Lagowski, J.J.,
The bonding in some bis(arene)chromium compounds as indicated by U. V. photoelectron zpectroscopy,
Inorg. Chim. Acta, 1982, 57, 195. [all data]