Manganese, tetracarbonylbis(η5-2,4-cyclopentadien-1-yl)-μ-methylenedi(mn-mn)

Gas phase ion energetics data

Data compiled by: Sharon G. Lias, Rhoda D. Levin, and Sherif A. Kafafi

Ionization energy determinations

IE (eV) Method Reference Comment
6.6PEGranozzi, Tondello, et al., 1981
6.75PEGranozzi, Tondello, et al., 1981Vertical value

References

Granozzi, Tondello, et al., 1981
Granozzi, G.; Tondello, E.; Casarin, M.; Ajo, D., Electronic structure of μ-methylene-bis-dicarbonyl (η5-cyclopentadienyl)-manganese by UV photoelectron spectroscopy, Inorg. Chim. Acta, 1981, 48, 73. [all data]