2(3H)-Thiophenone,3-(1,1-dimethylethyl)-3-methyl-
- Formula: C9H14OS
- Molecular weight: 170.272
- IUPAC Standard InChIKey: QIHAUAVZSKDDQK-UHFFFAOYSA-N
- CAS Registry Number: 57556-18-0
- Chemical structure:
View 3d structure (requires JavaScript / HTML 5) - Permanent link for this species. Use this link for bookmarking this species for future reference.

Gas phase ion energetics data

Data compiled by: Sharon G. Lias, Rhoda D. Levin, and Sherif A. Kafafi
Ionization energy determinations
IE (eV) | Method | Reference |
---|---|---|
8.38 ± 0.05 | EI | Thorstad, Undheim, et al., 1975 |

References

Thorstad, Undheim, et al., 1975
Thorstad, O.; Undheim, K.; Cederlund, B.; Hornfeldt, A.-B.,
Ionisation potentials in tautomeric analysis of 2-hydroxy derivatives of thiophenes, selenophenes, and furans,
Acta Chem. Scand. Ser. B:, 1975, 29, 647. [all data]