Thiophene,2-methoxy-3,5-dimethyl-
- Formula: C7H10OS
- Molecular weight: 142.219
- IUPAC Standard InChIKey: DULHFTMJIRMKHU-UHFFFAOYSA-N
- CAS Registry Number: 57556-17-9
- Chemical structure:
View 3d structure (requires JavaScript / HTML 5) - Permanent link for this species. Use this link for bookmarking this species for future reference.

Gas phase ion energetics data

Data compiled by: Sharon G. Lias, Rhoda D. Levin, and Sherif A. Kafafi
Ionization energy determinations
IE (eV) | Method | Reference |
---|---|---|
7.78 ± 0.05 | EI | Thorstad, Undheim, et al., 1975 |

References

Thorstad, Undheim, et al., 1975
Thorstad, O.; Undheim, K.; Cederlund, B.; Hornfeldt, A.-B.,
Ionisation potentials in tautomeric analysis of 2-hydroxy derivatives of thiophenes, selenophenes, and furans,
Acta Chem. Scand. Ser. B:, 1975, 29, 647. [all data]