Naphthalene, 1,3-dimethyl-
- Formula: C12H12
- Molecular weight: 156.2237
- IUPAC Standard InChIKey: QHJMFSMPSZREIF-UHFFFAOYSA-N
- CAS Registry Number: 575-41-7
- Chemical structure:
View 3d structure (requires JavaScript / HTML 5) - Other names: 1,3-Dimethylnaphthalene

Phase change data

Data compiled as indicated in comments:
BS - Robert L. Brown and Stephen E. Stein
TRC - Thermodynamics Research Center, NIST Boulder Laboratories, Chris Muzny director
Quantity | Value | Units | Method | Reference | Comment |
---|---|---|---|---|---|
Tboil | 536.2 | K | N/A | Weast and Grasselli, 1989 | BS |
Tboil | 538.2 | K | N/A | Evans and Smith, 1951 | Uncertainty assigned by TRC = 0.3 K; TRC |
Tboil | 538.0 | K | N/A | Kruber and Oberkobusch, 1951 | Uncertainty assigned by TRC = 4. K; TRC |
Tboil | 536. | K | N/A | Bailey, Bryant, et al., 1947 | Uncertainty assigned by TRC = 8. K; TRC |

Gas phase ion energetics data

Data compiled as indicated in comments:
LLK - Sharon G. Lias, Rhoda D. Levin, and Sherif A. Kafafi
Ionization energy determinations
IE (eV) | Method | Reference | Comment |
---|---|---|---|
7.86 ± 0.03 | PE | Heilbronner, Hoshi, et al., 1976 | Vertical value; LLK |

Kovats' RI, non-polar column, temperature ramp

Data compiled by: NIST Mass Spectrometry Data Center, William E. Wallace, director

Column type Capillary
Active phase OV-101
Column length (m) 110.
Carrier gas He
Substrate
Column diameter (mm) 0.25
Phase thickness (μm) 0.20
Tstart (C) 35.
Tend (C) 200.
Heat rate (K/min) 1.
Initial hold (min)
Final hold (min)
I 1391.
ReferenceHayes and Pitzer, 1982
Comment MSDC-RI

Gas phase thermochemistry data

Data compiled by: Glushko Thermocenter, Russian Academy of Sciences, Moscow

Constant pressure heat capacity of gas

Cp,gas (J/mol*K) Temperature (K) Reference Comment
46.250.Thermodynamics Research Center, 1997p=1 bar.
74.6100.
100.8150.
128.2200.
171.0273.15
185.9298.15
187.0300.
243.5400.
291.9500.
331.6600.
364.1700.
391.1800.
413.7900.
432.81000.
449.1100.
463.1200.
475.1300.
485.1400.
494.1500.

Lee's RI, non-polar column, temperature ramp

Data compiled by: NIST Mass Spectrometry Data Center, William E. Wallace, director

Column type CapillaryCapillaryCapillaryCapillaryCapillary
Active phase DB-5MS5 % Phenyl methyl siloxaneDB-5MSSE-52DB-5
Column length (m) 30. 30.30.25.
Carrier gas     He
Substrate
Column diameter (mm) 0.25 0.250.300.3
Phase thickness (μm) 0.25 0.5
Tstart (C) 50.50.40.40.60.
Tend (C) 300.250.310.250.270.
Heat rate (K/min) 6.2.10.4.5.
Initial hold (min) 2. 1. 2.
Final hold (min) 16.
I 242.99240.25243.42242.38242.97
ReferenceSun, Zhou, et al., 2008Skrbic and Onjia, 2006Chen, Keeran, et al., 2002Wang, Peng, et al., 1997Williams and Horne, 1995
Comment MSDC-RI MSDC-RI MSDC-RI MSDC-RI MSDC-RI
Column type CapillaryCapillaryCapillaryCapillaryCapillary
Active phase DB-5CP Sil 8 CBSE-54DB-5DB-5
Column length (m) 30.50.20.30.30.
Carrier gas HeHeHeHeHe
Substrate
Column diameter (mm) 0.320.250.220.260.25
Phase thickness (μm) 0.250.250.200.25
Tstart (C) 50.80.50.50.90.
Tend (C) 300.300.300.300.325.
Heat rate (K/min) 6.4.4.6.4.
Initial hold (min) 2.  4.
Final hold (min)    20.
I 243.31242.9243.35243.76240.23
ReferenceWang, Fingas, et al., 1994Bundt, Herbel, et al., 1991Guillén, Blanco, et al., 1989Rostad and Pereira, 1986Tong, Centen, et al., 1985
Comment MSDC-RI MSDC-RI MSDC-RI MSDC-RI MSDC-RI
Column type CapillaryCapillaryCapillary
Active phase DB-5SE-52SE-52
Column length (m) 30.20.12.
Carrier gas HeliumH2He
Substrate
Column diameter (mm) 0.320.300.3
Phase thickness (μm)  0.250.34
Tstart (C) 90.40.50.
Tend (C) 250.265.250.
Heat rate (K/min) 4.4.2.
Initial hold (min)  2.
Final hold (min)
I 236.0243.30240.25
ReferenceViau, Studak, et al., 1984Vassilaros, Kong, et al., 1982Lee, Vassilaros, et al., 1979
Comment MSDC-RI MSDC-RI MSDC-RI

Van Den Dool and Kratz RI, non-polar column, temperature ramp

Data compiled by: NIST Mass Spectrometry Data Center, William E. Wallace, director

Column type CapillaryCapillaryCapillaryCapillaryCapillary
Active phase DB-5DB-5DB-5DB-5DB-5
Column length (m) 30.30.30.30.30.
Carrier gas HeHeHeHeHe
Substrate
Column diameter (mm) 0.250.250.250.250.25
Phase thickness (μm) 0.250.250.250.250.25
Tstart (C) 40.40.40.40.40.
Tend (C) 310.310.310.310.310.
Heat rate (K/min) 2.4.6.2.4.
Initial hold (min)
Final hold (min)
I 1405.31416.51422.31405.31416.5
ReferenceSong, Lai, et al., 2003Song, Lai, et al., 2003Song, Lai, et al., 2003Lai and Song, 1995Lai and Song, 1995
Comment MSDC-RI MSDC-RI MSDC-RI MSDC-RI MSDC-RI
Column type CapillaryCapillaryCapillaryCapillary
Active phase DB-5Petrocol DHDB-5OV-101
Column length (m) 30.100.30.108.
Carrier gas HeHeHe
Substrate
Column diameter (mm) 0.250.250.260.25
Phase thickness (μm) 0.250.50.250.2
Tstart (C) 40.30.50.35.
Tend (C) 310.220.300.200.
Heat rate (K/min) 6.1.6.1.
Initial hold (min)   4.
Final hold (min)   20.
I 1422.31397.1427.1391.
ReferenceLai and Song, 1995White, Hackett, et al., 1992Rostad and Pereira, 1986Hayes and Pitzer, 1981
Comment MSDC-RI MSDC-RI MSDC-RI MSDC-RI

Kovats' RI, non-polar column, isothermal

Data compiled by: NIST Mass Spectrometry Data Center, William E. Wallace, director

Column type CapillaryCapillaryCapillaryCapillaryCapillary
Active phase OV-1OV-1OV-1OV-1SE-30
Column length (m) 25.25.25.25.100.
Carrier gas N2N2N2N2
Substrate
Column diameter (mm) 0.20.20.20.20.5
Phase thickness (μm) 0.330.330.330.33
Temperature (C) 150.150.150.160.130.
I 1414.1414.1415.1423.1400.
ReferenceZhang, Chen, et al., 1997Zhang, Chen, et al., 1997Zhang, Chen, et al., 1997Zhang, Chen, et al., 1997Bredael, 1982
Comment MSDC-RI MSDC-RI MSDC-RI MSDC-RI MSDC-RI
Column type CapillaryCapillaryPacked
Active phase SE-30OV-1SE-30
Column length (m) 100.50.
Carrier gas
Substrate
Column diameter (mm) 0.50.23
Phase thickness (μm)
Temperature (C) 150.130.150.
I 1414.1402.1416.
ReferenceBredael, 1982Engewald, Wennrich, et al., 1979Shlyakhov, Anvaer, et al., 1975
Comment MSDC-RI MSDC-RI MSDC-RI

Van Den Dool and Kratz RI, non-polar column, custom temperature program

Data compiled by: NIST Mass Spectrometry Data Center, William E. Wallace, director

Column type CapillaryCapillary
Active phase HP-55 % Phenyl methyl siloxane
Column length (m) 30.25.
Carrier gas HeHe
Substrate
Column diameter (mm) 0.250.31
Phase thickness (μm) 0.250.52
Program 40C(3min) => 4C/min => 208C => 25C/min => 290C(5min)50C(2min) => (20C/min) => 120C => (7C/min) => 310C(10min)
I 1415.41409.
ReferenceSandercock and du Pasquier, 2003Yasuhara, Shiraishi, et al., 1997
Comment MSDC-RI MSDC-RI

Normal alkane RI, non-polar column, custom temperature program

Data compiled by: NIST Mass Spectrometry Data Center, William E. Wallace, director

Column type CapillaryCapillaryCapillary
Active phase OV-1OV-1, SE-30, Methyl silicone, SP-2100, OV-101, DB-1, etc.OV-1, SE-30, Methyl silicone, SP-2100, OV-101, DB-1, etc.
Column length (m)  50.50.
Carrier gas  HydrogenHydrogen
Substrate
Column diameter (mm)  0.320.32
Phase thickness (μm)
Program not specifiednot specifiednot specified
I 1402.31400.1402.
ReferenceDimov, Osman, et al., 1994Waggott and Davies, 1984Waggott and Davies, 1984
Comment MSDC-RI MSDC-RI MSDC-RI

References

Weast and Grasselli, 1989
CRC Handbook of Data on Organic Compounds, 2nd Editon, Weast,R.C and Grasselli, J.G., ed(s)., CRC Press, Inc., Boca Raton, FL, 1989, 1. [all data]
Evans and Smith, 1951
Evans, R.F.; Smith, J.O.,
J. Inst. Pet., 1951, 37, 80. [all data]
Kruber and Oberkobusch, 1951
Kruber, O.; Oberkobusch, R.,
Chem. Ber., 1951, 84, 826. [all data]
Bailey, Bryant, et al., 1947
Bailey; Bryant; Hancock; Morrell; Smith, J.O.,
The ten dimethylnaphthalenes, their physical properties, molecular compounds, and ultra-violet spectra,
J. Inst. Pet., 1947, 33, 503. [all data]
Heilbronner, Hoshi, et al., 1976
Heilbronner, E.; Hoshi, T.; von Rosenberg, J.L.; Hafner, K.,
Alkyl-induced, natural hypsochromic shifts of the 2A←2X and 2B←2X transitions of azulene and naphthalene radical cations,
Nouv. J. Chim., 1976, 1, 105. [all data]