Benzo[g]phenanthro[3,4-c:6,5-c']diphenanthrene[10]helicene
- Formula: C42H24
- Molecular weight: 528.6400
- IUPAC Standard InChIKey: DZNSHUKRWMZMLS-UHFFFAOYSA-N
- CAS Registry Number: 57520-29-3
- Chemical structure:
View 3d structure (requires JavaScript / HTML 5) - Other names: Benzo[g[phenanthro[3,4-c:6,5-c']diphenanthrene

Gas phase ion energetics data

Data compiled as indicated in comments:
LLK - Sharon G. Lias, Rhoda D. Levin, and Sherif A. Kafafi
Ionization energy determinations
IE (eV) | Method | Reference | Comment |
---|---|---|---|
6.99 | PE | Obenland and Schmidt, 1975 | Vertical value; LLK |

References

Obenland and Schmidt, 1975
Obenland, S.; Schmidt, W.,
Photoelectron spectra of polynuclear aromatics. IV. The helicenes,
J. Am. Chem. Soc., 1975, 97, 6633. [all data]