[14]Helicene
- Formula: C58H32
- Molecular weight: 728.8747
- IUPAC Standard InChIKey: FYHJTLVERBIHKT-UHFFFAOYSA-N
- CAS Registry Number: 57483-71-3
- Chemical structure:
View 3d structure (requires JavaScript / HTML 5) - Other names: Diphenanthro[4,3-g:4',3'-g']naphtho[2,1-c:7,8-c']diphenanthrene

Gas phase ion energetics data

Data compiled as indicated in comments:
LLK - Sharon G. Lias, Rhoda D. Levin, and Sherif A. Kafafi
Ionization energy determinations
IE (eV) | Method | Reference | Comment |
---|---|---|---|
6.88 | PE | Obenland and Schmidt, 1975 | Vertical value; LLK |

References

Obenland and Schmidt, 1975
Obenland, S.; Schmidt, W.,
Photoelectron spectra of polynuclear aromatics. IV. The helicenes,
J. Am. Chem. Soc., 1975, 97, 6633. [all data]