Bisbenzo[5,6]phenanthro[3,4-c:4',3'-g]phenanthrene
- Formula: C46H26
- Molecular weight: 578.6986
- IUPAC Standard InChIKey: BWVBAFLXLKBSEB-UHFFFAOYSA-N
- CAS Registry Number: 57468-45-8
- Chemical structure:
View 3d structure (requires JavaScript / HTML 5) - Permanent link for this species. Use this link for bookmarking this species for future reference.

Gas phase ion energetics data

Data compiled as indicated in comments:
LLK - Sharon G. Lias, Rhoda D. Levin, and Sherif A. Kafafi
Ionization energy determinations
IE (eV) | Method | Reference | Comment |
---|---|---|---|
6.95 | PE | Obenland and Schmidt, 1975 | Vertical value; LLK |

References

Obenland and Schmidt, 1975
Obenland, S.; Schmidt, W.,
Photoelectron spectra of polynuclear aromatics. IV. The helicenes,
J. Am. Chem. Soc., 1975, 97, 6633. [all data]