Methanamine, N-hydroxy-N-methyl-
- Formula: C2H7NO
- Molecular weight: 61.0831
- IUPAC Standard InChIKey: VMESOKCXSYNAKD-UHFFFAOYSA-N
- CAS Registry Number: 5725-96-2
- Chemical structure:
View 3d structure (requires JavaScript / HTML 5) - Other names: N,N-Dimethylhydroxylamine

Phase change data

Data compiled as indicated in comments:
AC - William E. Acree, Jr., James S. Chickos
Enthalpy of vaporization
ΔvapH (kJ/mol) | Temperature (K) | Method | Reference | Comment |
---|---|---|---|---|
45.7 | 305. | A | Stephenson and Malanowski, 1987 | Based on data from 290. to 363. K. See also Bissot, Parry, et al., 1957 and Boublik, Fried, et al., 1984.; AC |
Antoine Equation Parameters
log10(P) = A − (B / (T + C))
P = vapor pressure (bar)
T = temperature (K)
View plot Requires a JavaScript / HTML 5 canvas capable browser.
Temperature (K) | A | B | C | Reference | Comment |
---|---|---|---|---|---|
290.8 to 363. | 4.67111 | 1405.452 | -72.215 | Bissot, Parry, et al., 1957 | Coefficents calculated by NIST from author's data. |

Gas phase ion energetics data

Data compiled by: Sharon G. Lias, Rhoda D. Levin, and Sherif A. Kafafi
Appearance energy determinations
Ion | AE (eV) | Other Products | Method | Reference | Comment |
---|---|---|---|---|---|
C2H7NO+ | 9.18 | ? | PE | Rademacher and Freckmann, 1980 | Vertical value |

References

Stephenson and Malanowski, 1987
Stephenson, Richard M.; Malanowski, Stanislaw,
Handbook of the Thermodynamics of Organic Compounds, 1987, https://doi.org/10.1007/978-94-009-3173-2
. [all data]
Bissot, Parry, et al., 1957
Bissot, T.C.; Parry, R.W.; Campbell, D.H.,
The Physical and Chemical Properties of the Methylhydroxylamines 1,
J. Am. Chem. Soc., 1957, 79, 4, 796-800, https://doi.org/10.1021/ja01561a005
. [all data]
Boublik, Fried, et al., 1984
Boublik, T.; Fried, V.; Hala, E.,
The Vapour Pressures of Pure Substances: Selected Values of the Temperature Dependence of the Vapour Pressures of Some Pure Substances in the Normal and Low Pressure Region, 2nd ed., Elsevier, New York, 1984, 972. [all data]
Rademacher and Freckmann, 1980
Rademacher, P.; Freckmann, B.,
Photoelektronen spektren und Konformations-verhalten von Hydroxylamin und Methylhydroxylaminen,
J. Electron Spectrosc. Relat. Phenom., 1980, 19, 251. [all data]