trans-Phenanthrene, 9,10-dihydro-9,10-diol
- Formula: C14H12O2
- Molecular weight: 212.2439
- IUPAC Standard InChIKey: MFXNBQWUTDDOKE-UHFFFAOYSA-N
- CAS Registry Number: 572-41-8
- Chemical structure:
View 3d structure (requires JavaScript / HTML 5) - Species with the same structure:
- Other names: 9,10-Phenanthrenediol, 9,10-dihydro- (E)-

Gas phase ion energetics data

Data compiled by: Sharon G. Lias, Rhoda D. Levin, and Sherif A. Kafafi
Ionization energy determinations
IE (eV) | Method | Reference | Comment |
---|---|---|---|
8.13 | PE | Akiyama, Li, et al., 1979 | Vertical value |

Kovats' RI, non-polar column, isothermal

Column type | Active phase | Temperature (C) | I | Reference | Comment |
---|---|---|---|---|---|
Packed | OV-1 | 180. | 2020. | Brooks, Cole, et al., 1982 | Helium or Nitrogen, Gas-Chrom Q (100-120 mesh); Column length: 1.8 m; Column diameter: 0.25 mm |

References

Akiyama, Li, et al., 1979
Akiyama, I.; Li, K.C.; LeBreton, P.R.; Fu, P.P.; Harvey, R.G.,
Ultraviolet photoelectron studies of polycyclic aromatic hydrocarbons. The ground-state electronic structure of aryloxiranes and metabolites of benzo[a]pyrene,
J. Phys. Chem., 1979, 83, 2997. [all data]
Brooks, Cole, et al., 1982
Brooks, C.J.W.; Cole, W.J.; Borthwick, J.H.; Brown, G.M.,
Characterization of Dihydroarenediols and Related Compounds by Gas Chromatography-Mass Spectrometry: Comparison of Derivatives,
J. Chromatogr., 1982, 239, 191-216, https://doi.org/10.1016/S0021-9673(00)81980-9
. [all data]