Naphthalene, 1,4-dimethyl-
- Formula: C12H12
- Molecular weight: 156.2237
- IUPAC Standard InChIKey: APQSQLNWAIULLK-UHFFFAOYSA-N
- CAS Registry Number: 571-58-4
- Chemical structure:
View 3d structure (requires JavaScript / HTML 5) - Other names: 1,4-Dimethylnaphthalene; 1,4-Dimethylnapthalene

Gas phase thermochemistry data

Data compiled by: Glushko Thermocenter, Russian Academy of Sciences, Moscow
Constant pressure heat capacity of gas
Cp,gas (J/mol*K) | Temperature (K) | Reference | Comment |
---|---|---|---|
41.4 | 50. | Thermodynamics Research Center, 1997 | p=1 bar. |
71.3 | 100. | ||
100.5 | 150. | ||
130.0 | 200. | ||
174.2 | 273.15 | ||
189.2 | 298.15 | ||
190.3 | 300. | ||
246.8 | 400. | ||
294.7 | 500. | ||
333.9 | 600. | ||
366.0 | 700. | ||
392.6 | 800. | ||
415.0 | 900. | ||
433.9 | 1000. | ||
450. | 1100. | ||
464. | 1200. | ||
476. | 1300. | ||
486. | 1400. | ||
494. | 1500. |

Gas phase ion energetics data

Data compiled as indicated in comments:
LLK - Sharon G. Lias, Rhoda D. Levin, and Sherif A. Kafafi
RDSH - Henry M. Rosenstock, Keith Draxl, Bruce W. Steiner, and John T. Herron
B - John E. Bartmess
Electron affinity determinations
EA (eV) | Method | Reference | Comment |
---|---|---|---|
<0.247 ± 0.078 | ECD | Wojnarovits and Foldiak, 1981 | EA is an upper limit: Chen and Wentworth, 1989. G3MP2B3 calculations indicate an EA of ca. -0.2 eV, anion unbound.; B |
Ionization energy determinations
IE (eV) | Method | Reference | Comment |
---|---|---|---|
7.78 ± 0.03 | EI | Nounou, 1966 | RDSH |
7.82 ± 0.03 | PE | Heilbronner, Hoshi, et al., 1976 | Vertical value; LLK |
Appearance energy determinations
Ion | AE (eV) | Other Products | Method | Reference | Comment |
---|---|---|---|---|---|
C12H11+ | 12.9 ± 0.1 | H | EI | Nounou, 1966 | RDSH |

Phase change data

Data compiled as indicated in comments:
TRC - Thermodynamics Research Center, NIST Boulder Laboratories, Chris Muzny director
BS - Robert L. Brown and Stephen E. Stein
AC - William E. Acree, Jr., James S. Chickos
Quantity | Value | Units | Method | Reference | Comment |
---|---|---|---|---|---|
Tboil | 541.6 | K | N/A | Anonymous, 1949 | Uncertainty assigned by TRC = 1. K; TRC |
Tboil | 536. | K | N/A | Bailey, Bryant, et al., 1947 | Uncertainty assigned by TRC = 4. K; TRC |
Tboil | 539. | K | N/A | Newman and Hussey, 1947 | Uncertainty assigned by TRC = 5. K; TRC |
Tboil | 537. | K | N/A | Barnett and Sanders, 1933 | Uncertainty assigned by TRC = 4. K; TRC |
Quantity | Value | Units | Method | Reference | Comment |
Tfus | 279. ± 20. | K | AVG | N/A | Average of 12 values; Individual data points |
Reduced pressure boiling point
Tboil (K) | Pressure (atm) | Reference | Comment |
---|---|---|---|
536.2 | 0.988 | Aldrich Chemical Company Inc., 1990 | BS |
Enthalpy of fusion
ΔfusH (kcal/mol) | Temperature (K) | Method | Reference | Comment |
---|---|---|---|---|
2.53 | 279.2 | DSC | Cheon and Kim, 2007 | AC |
2.53 | 279.9 | N/A | Acree, 1991 | AC |

Kovats' RI, non-polar column, isothermal

Column type | Active phase | Temperature (C) | I | Reference | Comment |
---|---|---|---|---|---|
Capillary | Squalane | 120. | 1410.6 | Gerasimenko and Nabivach, 1997 | Column length: 50. m |
Capillary | OV-1 | 150. | 1418. | Zhang, Chen, et al., 1997 | 25. m/0.2 mm/0.33 μm, N2 |
Capillary | OV-1 | 150. | 1418. | Zhang, Chen, et al., 1997 | 25. m/0.2 mm/0.33 μm, N2 |
Capillary | OV-1 | 150. | 1418. | Zhang, Chen, et al., 1997 | 25. m/0.2 mm/0.33 μm, N2 |
Capillary | OV-1 | 160. | 1439. | Zhang, Chen, et al., 1997 | 25. m/0.2 mm/0.33 μm, N2 |
Capillary | CP Sil 8 CB | 130. | 1442.8 | Schaefer and Höltkemeier, 1992 | 50. m/0.32 mm/0.25 μm |
Capillary | SE-30 | 130. | 1418. | Bredael, 1982 | Column length: 100. m; Column diameter: 0.5 mm |
Capillary | SE-30 | 150. | 1431. | Bredael, 1982 | Column length: 100. m; Column diameter: 0.5 mm |
Capillary | OV-101 | 140. | 1425.9 | Gerasimenko, Kirilenko, et al., 1981 | N2; Column length: 50. m; Column diameter: 0.3 mm |
Capillary | OV-1 | 130. | 1419. | Engewald, Wennrich, et al., 1979 | Column length: 50. m; Column diameter: 0.23 mm |
Capillary | Squalane | 130. | 1397. | Bogoslovsky, Anvaer, et al., 1978 |

Kovats' RI, non-polar column, temperature ramp

Column type | Active phase | I | Reference | Comment |
---|---|---|---|---|
Capillary | OV-101 | 1409. | Hayes and Pitzer, 1982 | 110. m/0.25 mm/0.20 μm, He, 1. K/min; Tstart: 35. C; Tend: 200. C |

Van Den Dool and Kratz RI, non-polar column, temperature ramp

Column type | Active phase | I | Reference | Comment |
---|---|---|---|---|
Capillary | DB-5 | 1424.2 | Song, Lai, et al., 2003 | 30. m/0.25 mm/0.25 μm, He, 2. K/min; Tstart: 40. C; Tend: 310. C |
Capillary | DB-5 | 1436.3 | Song, Lai, et al., 2003 | 30. m/0.25 mm/0.25 μm, He, 4. K/min; Tstart: 40. C; Tend: 310. C |
Capillary | DB-5 | 1443.2 | Song, Lai, et al., 2003 | 30. m/0.25 mm/0.25 μm, He, 6. K/min; Tstart: 40. C; Tend: 310. C |
Capillary | DB-5 | 1424.2 | Lai and Song, 1995 | 30. m/0.25 mm/0.25 μm, He, 2. K/min; Tstart: 40. C; Tend: 310. C |
Capillary | DB-5 | 1436.3 | Lai and Song, 1995 | 30. m/0.25 mm/0.25 μm, He, 4. K/min; Tstart: 40. C; Tend: 310. C |
Capillary | DB-5 | 1443.2 | Lai and Song, 1995 | 30. m/0.25 mm/0.25 μm, He, 6. K/min; Tstart: 40. C; Tend: 310. C |
Capillary | Petrocol DH | 1415. | White, Hackett, et al., 1992 | 100. m/0.25 mm/0.5 μm, He, 1. K/min; Tstart: 30. C; Tend: 220. C |
Capillary | DB-5 | 1447. | Rostad and Pereira, 1986 | 30. m/0.26 mm/0.25 μm, He, 50. C @ 4. min, 6. K/min, 300. C @ 20. min |
Capillary | Ultra-1 | 1399.47 | Haynes and Pitzer, 1985 | 50. m/0.22 mm/0.33 μm, He, 1. K/min; Tstart: -30. C; Tend: 240. C |
Capillary | Ultra-1 | 1411.24 | Haynes and Pitzer, 1985 | 50. m/0.22 mm/0.33 μm, He, 2. K/min; Tstart: -30. C; Tend: 240. C |
Capillary | Ultra-1 | 1419.17 | Haynes and Pitzer, 1985 | 50. m/0.22 mm/0.33 μm, He, 3. K/min; Tstart: -30. C; Tend: 240. C |
Capillary | Ultra-2 | 1436.73 | Haynes and Pitzer, 1985 | 50. m/0.22 mm/0.33 μm, He, 1. K/min; Tstart: -30. C; Tend: 240. C |
Capillary | OV-101 | 1409. | Hayes and Pitzer, 1981 | 108. m/0.25 mm/0.2 μm, 1. K/min; Tstart: 35. C; Tend: 200. C |

Van Den Dool and Kratz RI, non-polar column, custom temperature program

Column type | Active phase | I | Reference | Comment |
---|---|---|---|---|
Capillary | HP-5 | 1435. | Sandercock and du Pasquier, 2003 | 30. m/0.25 mm/0.25 μm, He; Program: 40C(3min) => 4C/min => 208C => 25C/min => 290C(5min) |

Van Den Dool and Kratz RI, polar column, temperature ramp

Column type | Active phase | I | Reference | Comment |
---|---|---|---|---|
Capillary | Supelcowax-10 | 2041. | Chung, 1999 | 60. m/0.25 mm/0.25 μm, He, 35. C @ 5. min, 2. K/min, 195. C @ 90. min |

Normal alkane RI, non-polar column, isothermal

Column type | Active phase | Temperature (C) | I | Reference | Comment |
---|---|---|---|---|---|
Capillary | OV-101 | 120. | 1426. | Nabivach and Gerasimenko, 1996 | |
Capillary | Squalane | 130. | 1397. | Papazova and Pankova, 1975 | N2; Column length: 100. m; Column diameter: 0.25 mm |

Normal alkane RI, non-polar column, temperature ramp

Column type | Active phase | I | Reference | Comment |
---|---|---|---|---|
Capillary | Petrocol DH | 1415. | Supelco, 2012 | 100. m/0.25 mm/0.50 μm, Helium, 20. C @ 15. min, 15. K/min, 220. C @ 30. min |
Capillary | Ultra-1 | 1420. | Elizalde-González, Hutfliess, et al., 1996 | 50. m/0.2 mm/0.33 μm, H2, 3. K/min, 300. C @ 35. min; Tstart: 60. C |

Normal alkane RI, non-polar column, custom temperature program

Column type | Active phase | I | Reference | Comment |
---|---|---|---|---|
Capillary | CP Sil 8 CB | 1443. | Bertsch, 1999 | Program: not specified |
Capillary | OV-1 | 1419. | Dimov, Osman, et al., 1994 | Program: not specified |
Capillary | OV-1, SE-30, Methyl silicone, SP-2100, OV-101, DB-1, etc. | 1409. | Waggott and Davies, 1984 | Hydrogen; Column length: 50. m; Column diameter: 0.32 mm; Program: not specified |

Normal alkane RI, polar column, custom temperature program

Column type | Active phase | I | Reference | Comment |
---|---|---|---|---|
Capillary | SOLGel-Wax | 2041. | Shu and Shen, 2008 | 30. m/0.53 mm/0.50 μm, Helium; Program: 40 0C 7 0C/min -> 180 0C 10 0C/min -> 240 0C (10 min) |

Lee's RI, non-polar column, temperature ramp

Column type | Active phase | I | Reference | Comment |
---|---|---|---|---|
Capillary | DB-5MS | 246.51 | Sun, Zhou, et al., 2008 | 30. m/0.25 mm/0.25 μm, 50. C @ 2. min, 6. K/min, 300. C @ 16. min |
Capillary | 5 % Phenyl methyl siloxane | 243.57 | Skrbic and Onjia, 2006 | 2. K/min; Tstart: 50. C; Tend: 250. C |
Capillary | DB-5MS | 246.55 | Chen, Keeran, et al., 2002 | 30. m/0.25 mm/0.5 μm, 40. C @ 1. min, 10. K/min; Tend: 310. C |
Capillary | HP-5 | 246.42 | Piao, Chu, et al., 1999 | 30. m/0.25 mm/0.25 μm, 50. C @ 2. min, 4. K/min, 280. C @ 20. min |
Capillary | SE-52 | 243.02 | Wang, Peng, et al., 1997 | 4. K/min; Column length: 30. m; Column diameter: 0.30 mm; Tstart: 40. C; Tend: 250. C |
Capillary | DB-5 | 245.70 | Williams and Horne, 1995 | He, 60. C @ 2. min, 5. K/min; Column length: 25. m; Column diameter: 0.3 mm; Tend: 270. C |
Capillary | CP Sil 8 CB | 246.2 | Bundt, Herbel, et al., 1991 | 50. m/0.25 mm/0.25 μm, He, 4. K/min; Tstart: 80. C; Tend: 300. C |
Capillary | DB-5 | 247.15 | Rostad and Pereira, 1986 | 30. m/0.26 mm/0.25 μm, He, 50. C @ 4. min, 6. K/min, 300. C @ 20. min |
Capillary | SE-52 | 246.03 | Vassilaros, Kong, et al., 1982 | 20. m/0.30 mm/0.25 μm, H2, 40. C @ 2. min, 4. K/min; Tend: 265. C |
Capillary | SE-52 | 243.57 | Lee, Vassilaros, et al., 1979 | 12. m/0.3 mm/0.34 μm, He, 2. K/min; Tstart: 50. C; Tend: 250. C |

Lee's RI, non-polar column, custom temperature program

Column type | Active phase | I | Reference | Comment |
---|---|---|---|---|
Capillary | DB-5 | 245.4 | Fuentes, Font, et al., 2007 | Column length: 60. m; Program: not specified |
Capillary | DB-5MS | 246.5 | Aracil, Font, et al., 2005 | Column length: 60. m; Column diameter: 0.25 mm; Program: not specified |
Capillary | Ultra-1 | 243.6 | Sremac, Skrbic, et al., 2005 | 50. m/0.32 mm/0.50 μm, Nitrogen; Program: 40-100 0C 3-15 0C/min -> 290 0C |
Capillary | HP-5 | 247.02 | Sandercock and du Pasquier, 2003 | 30. m/0.25 mm/0.25 μm, He; Program: 40C(3min) => 4C/min => 208C => 25C/min => 290C(5min) |
Capillary | SE-52 | 243.98 | Wang, Peng, et al., 1997 | Column length: 30. m; Column diameter: 0.30 mm; Program: not specified |
Capillary | CP Sil 8 CB | 246.0 | Bundt, Herbel, et al., 1991 | 50. m/0.25 mm/0.25 μm, He; Program: not specified |
Capillary | CP Sil 8 CB | 246.3 | Bundt, Herbel, et al., 1991 | 50. m/0.25 mm/0.25 μm, He; Program: not specified |

Henry's Law data

Data compiled by: Rolf Sander
Henry's Law constant (water solution)
kH(T) = k°H exp(d(ln(kH))/d(1/T) ((1/T) - 1/(298.15 K)))
k°H = Henry's law constant for solubility in water at 298.15 K (mol/(kg*bar))
d(ln(kH))/d(1/T) = Temperature dependence constant (K)
k°H (mol/(kg*bar)) | d(ln(kH))/d(1/T) (K) | Method | Reference | Comment |
---|---|---|---|---|
2.0 | Q | N/A | missing citation give several references for the Henry's law constants but don't assign them to specific species. |

References

Thermodynamics Research Center, 1997
Thermodynamics Research Center,
Selected Values of Properties of Chemical Compounds., Thermodynamics Research Center, Texas A&M University, College Station, Texas, 1997. [all data]
Wojnarovits and Foldiak, 1981
Wojnarovits, L.; Foldiak, G.,
Electron capture detection of aromatic hydrocarbons,
J. Chromatogr. Sci., 1981, 206, 511. [all data]
Chen and Wentworth, 1989
Chen, E.C.M.; Wentworth, W.E.,
Experimental Determination of Electron Affinities of Organic Molecules,
Mol. Cryst. Liq. Cryst., 1989, 171, 271. [all data]
Nounou, 1966
Nounou, P.,
Etude des composes aromatiques par spectrometrie de masse. I. Mesure des potentials d'ionisation et d'apparition par la methode du potential retardateur et interpretation des courbes d'ionisation differentielle,
J. Chim. Phys., 1966, 63, 994. [all data]
Heilbronner, Hoshi, et al., 1976
Heilbronner, E.; Hoshi, T.; von Rosenberg, J.L.; Hafner, K.,
Alkyl-induced, natural hypsochromic shifts of the 2A←2X and 2B←2X transitions of azulene and naphthalene radical cations,
Nouv. J. Chim., 1976, 1, 105. [all data]