2-Propanol, 1,1,1-trichloro-2-methyl-
- Formula: C4H7Cl3O
- Molecular weight: 177.457
- IUPAC Standard InChIKey: OSASVXMJTNOKOY-UHFFFAOYSA-N
- CAS Registry Number: 57-15-8
- Chemical structure:

Phase change data

Data compiled as indicated in comments:
BS - Robert L. Brown and Stephen E. Stein
TRC - Thermodynamics Research Center, NIST Boulder Laboratories, Chris Muzny director
Quantity | Value | Units | Method | Reference | Comment |
---|---|---|---|---|---|
Tboil | 440.2 | K | N/A | Weast and Grasselli, 1989 | BS |
Tboil | 442. | K | N/A | Lombard and Boesch, 1954 | Uncertainty assigned by TRC = 4. K; TRC |
Quantity | Value | Units | Method | Reference | Comment |
Tfus | 371.9 | K | N/A | Lombard and Boesch, 1954 | Uncertainty assigned by TRC = 1.5 K; TRC |

Gas phase ion energetics data

Data compiled by: Sharon G. Lias, John E. Bartmess, Joel F. Liebman, John L. Holmes, Rhoda D. Levin, and W. Gary Mallard
Ionization energy determinations
IE (eV) | Method | Reference |
---|---|---|
10.38 | PE | Koppel, Molder, et al., 1983 |

Normal alkane RI, non-polar column, custom temperature program

View large format table.

Column type Active phase I Reference Comment
CapillarySPB-1976.Flanagan, Streete, et al., 199760. m/0.53 mm/5. μm, He; Program: 40C(6min) => 5C/min => 80C => 10C/min => 200C
CapillarySPB-1976.Strete, Ruprah, et al., 199260. m/0.53 mm/5.0 μm, Helium; Program: 40 0C (6 min) 5 0C/min -> 80 0C 10 0C/min -> 200 0C
CapillarySPB-1949.Strete, Ruprah, et al., 199260. m/0.53 mm/5.0 μm, Helium; Program: not specified
CapillaryOV-1949.Ramsey and Flanagan, 1982Program: not specified

Normal alkane RI, polar column, custom temperature program

View large format table.

Column type Active phase I Reference Comment
CapillaryCarbowax 20M1638.Ramsey and Flanagan, 1982Program: not specified

References

Weast and Grasselli, 1989
CRC Handbook of Data on Organic Compounds, 2nd Editon, Weast,R.C and Grasselli, J.G., ed(s)., CRC Press, Inc., Boca Raton, FL, 1989, 1. [all data]
Lombard and Boesch, 1954
Lombard, R.; Boesch, R.,
The Action of Carbon Tetrachloride on Saturated Aliphatic Methyl Ketones in the Presence of Alkaline Agents,
C. R. Hebd. Seances Acad. Sci., 1954, 238, 483-5. [all data]
Koppel, Molder, et al., 1983
Koppel, I.A.; Molder, U.H.; Pikver, R.J.,
Photoelectron spectra of molecules. I. Alcohols,
Org. React. Tartu, 1983, 20, 45. [all data]