1-Propanol, 3-methoxy-2,2-dimethyl-
- Formula: C6H14O2
- Molecular weight: 118.1742
- IUPAC Standard InChIKey: BEQOBRGLAAGQDU-UHFFFAOYSA-N
- CAS Registry Number: 57021-67-7
- Chemical structure:
View 3d structure (requires JavaScript / HTML 5) - Permanent link for this species. Use this link for bookmarking this species for future reference.

Gas phase ion energetics data

Data compiled by: Sharon G. Lias and Joel F. Liebman
Appearance energy determinations
Ion | AE (eV) | Other Products | Method | Reference | Comment |
---|---|---|---|---|---|
C5H12O+ | 9.66 ± 0.05 | H2CO | EI | Bissonnette, George, et al., 1990 |

References

Bissonnette, George, et al., 1990
Bissonnette, M.; George, M.; Holmes, J.L.,
The experimental investigation of [C5H12O] ion structures related to neopentyl alcohol and its methyl ether,
Int. J. Mass Spectrom. Ion Processes, 1990, 101, 309. [all data]