Benzenemethanamine,N,N,ar-trimethyl-
- Formula: C10H15N
- Molecular weight: 149.2328
- IUPAC Standard InChIKey: VCBUGWOFLYITCB-UHFFFAOYSA-N
- CAS Registry Number: 56927-89-0
- Chemical structure:
View 3d structure (requires JavaScript / HTML 5) - Permanent link for this species. Use this link for bookmarking this species for future reference.

Gas phase ion energetics data

Data compiled by: Sharon G. Lias, Rhoda D. Levin, and Sherif A. Kafafi
Ionization energy determinations
IE (eV) | Method | Reference |
---|---|---|
7.61 | PI | Akopyan, Vilesov, et al., 1975 |
Appearance energy determinations
Ion | AE (eV) | Other Products | Method | Reference | Comment |
---|---|---|---|---|---|
C2H6N+ | 9.49 | C8H9 | PI | Akopyan, Vilesov, et al., 1975 | |
C3H7N+ | 10.9 | C7H8 | PI | Akopyan, Vilesov, et al., 1975 | |
C3H8N+ | 9.6 | C7H7 | PI | Akopyan, Vilesov, et al., 1975 | |
C8H9+ | 10.92 | C2H6N | PI | Akopyan, Vilesov, et al., 1975 | |
C8H10+ | 9.6 | C2H5N | PI | Akopyan, Vilesov, et al., 1975 | |
C10H14N+ | 9.5 | H | PI | Akopyan, Vilesov, et al., 1975 |

References

Akopyan, Vilesov, et al., 1975
Akopyan, M.E.; Vilesov, F.I.; Loginov, Y.V.,
Photoionization of amines and the monomolecular decomposition of excited molecular ions,
Khim. Vys. Energ., 1975, 9, 327. [all data]