2,3-Cyclobutenopyridine
- Formula: C7H7N
- Molecular weight: 105.1372
- CAS Registry Number: 56911-25-2

Gas phase ion energetics data

Data evaluated as indicated in comments:
HL - Edward P. Hunter and Sharon G. Lias
Data compiled as indicated in comments:
LLK - Sharon G. Lias, Rhoda D. Levin, and Sherif A. Kafafi
Quantity | Value | Units | Method | Reference | Comment |
---|---|---|---|---|---|
Proton affinity (review) | 228.0 | kcal/mol | N/A | Hunter and Lias, 1998 | HL |
Quantity | Value | Units | Method | Reference | Comment |
Gas basicity | 220.4 | kcal/mol | N/A | Hunter and Lias, 1998 | HL |
Ionization energy determinations
IE (eV) | Method | Reference | Comment |
---|---|---|---|
9.1 | PE | Aue and Bowers, 1979 | Vertical value; LLK |

References

Hunter and Lias, 1998
Hunter, E.P.; Lias, S.G.,
Evaluated Gas Phase Basicities and Proton Affinities of Molecules: An Update,
J. Phys. Chem. Ref. Data, 1998, 27, 3, 413-656, https://doi.org/10.1063/1.556018
. [all data]
Aue and Bowers, 1979
Aue, D.H.; Bowers, M.T.,
Chapter 9. Stabilities of positive ions from equilibrium gas phase basicity measurements
in Ions Chemistry,, ed. M.T. Bowers, 1979. [all data]