1-Butyne, 3-methyl
- Formula: C5H7
- Molecular weight: 67.1091
- IUPAC Standard InChIKey: USCSRAJGJYMJFZ-UHFFFAOYSA-N
- CAS Registry Number: 56897-57-5
- Chemical structure:
View 3d structure (requires JavaScript / HTML 5) - Species with the same structure:

Gas phase ion energetics data

Data compiled as indicated in comments:
LLK - Sharon G. Lias, Rhoda D. Levin, and Sherif A. Kafafi
Ionization energy determinations
IE (eV) | Method | Reference | Comment |
---|---|---|---|
7.44 | EI | Lossing and Traeger, 1975 | LLK |

References

Lossing and Traeger, 1975
Lossing, F.P.; Traeger, J.C.,
Free radicals by mass spectrometry XLVI. Heats of formation of C5H7 and C5H9 radicals and cations.,
J. Am. Chem. Soc., 1975, 19, 9. [all data]