Lysine
- Formula: C6H14N2O2
- Molecular weight: 146.1876
- IUPAC Standard InChIKey: KDXKERNSBIXSRK-RXMQYKEDSA-N
- CAS Registry Number: 56-87-1
- Chemical structure:
- Stereoisomers:
- Other names: L-Lysine; Lysine, L-; (S)-α,ε-Diaminocaproic acid; Hexanoic acid, 2,6-diamino-, (S)-; L-(+)-Lysine; Lysine acid; 2,6-Diaminohexanoic acid; α,ε-Diaminocaproic acid; L-H2N(CH2)4CH(NH2)COOH; Aminutrin; (S)-2,6-Diaminohexanoic acid; α-Lysine; (S)-Lysine; Lys; h-Lys-oh; L-Norleucine, 6-amino-

Condensed phase thermochemistry data

Data compiled by: Hussein Y. Afeefy, Joel F. Liebman, and Stephen E. Stein
Quantity | Value | Units | Method | Reference | Comment |
---|---|---|---|---|---|
ΔfH°solid | -678.7 ± 1.5 | kJ/mol | Ccb | Vasil'ev, Borodin, et al., 1991 | |
Quantity | Value | Units | Method | Reference | Comment |
ΔcH°solid | -3683.2 ± 1.5 | kJ/mol | Ccb | Vasil'ev, Borodin, et al., 1991 |

Gas phase ion energetics data

Data evaluated as indicated in comments:
HL - Edward P. Hunter and Sharon G. Lias
Data compiled as indicated in comments:
B - John E. Bartmess
LBLHLM - Sharon G. Lias, John E. Bartmess, Joel F. Liebman, John L. Holmes, Rhoda D. Levin, and W. Gary Mallard
Quantity | Value | Units | Method | Reference | Comment |
---|---|---|---|---|---|
Proton affinity (review) | 996. | kJ/mol | N/A | Hunter and Lias, 1998 | HL |
Quantity | Value | Units | Method | Reference | Comment |
Gas basicity | 951.0 | kJ/mol | N/A | Hunter and Lias, 1998 | HL |
Ionization energy determinations
IE (eV) | Method | Reference | Comment |
---|---|---|---|
8.6 | PE | Cannington and Ham, 1983 | LBLHLM |
9.5 | PE | Cannington and Ham, 1983 | Vertical value; LBLHLM |
De-protonation reactions
C6H13N2O2- + =
By formula: C6H13N2O2- + H+ = C6H14N2O2
Quantity | Value | Units | Method | Reference | Comment |
---|---|---|---|---|---|
ΔrH° | 1416. ± 7.1 | kJ/mol | CIDC | Jones, Bernier, et al., 2007 | gas phase; B |
ΔrH° | 1411. ± 13. | kJ/mol | G+TS | O'Hair, Bowie, et al., 1992 | gas phase; B |
Quantity | Value | Units | Method | Reference | Comment |
ΔrG° | 1383. ± 13. | kJ/mol | CIDC | O'Hair, Bowie, et al., 1992 | gas phase; B |

Reaction thermochemistry data

Data compiled by: John E. Bartmess
Individual Reactions
C6H13N2O2- + =
By formula: C6H13N2O2- + H+ = C6H14N2O2
Quantity | Value | Units | Method | Reference | Comment |
---|---|---|---|---|---|
ΔrH° | 338.4 ± 1.7 | kcal/mol | CIDC | Jones, Bernier, et al., 2007 | gas phase |
ΔrH° | 337.3 ± 3.1 | kcal/mol | G+TS | O'Hair, Bowie, et al., 1992 | gas phase |
Quantity | Value | Units | Method | Reference | Comment |
ΔrG° | 330.5 ± 3.0 | kcal/mol | CIDC | O'Hair, Bowie, et al., 1992 | gas phase |

References

Vasil'ev, Borodin, et al., 1991
Vasil'ev, V.P.; Borodin, V.A.; Kopnyshev, S.B.,
Calculation of the standard enthalpies of combustion and of formation of crystalline organic acids and complexones from the energy contributions of atomic groups,
Russ. J. Phys. Chem. (Engl. Transl.), 1991, 65, 29-32. [all data]
Hunter and Lias, 1998
Hunter, E.P.; Lias, S.G.,
Evaluated Gas Phase Basicities and Proton Affinities of Molecules: An Update,
J. Phys. Chem. Ref. Data, 1998, 27, 3, 413-656, https://doi.org/10.1063/1.556018
. [all data]
Cannington and Ham, 1983
Cannington, P.H.; Ham, N.S.,
He(I) and He(II) photoelectron spectra of glycine and related molecules,
J. Electron Spectrosc. Relat. Phenom., 1983, 32, 139. [all data]
Jones, Bernier, et al., 2007
Jones, C.M.; Bernier, M.; Carson, E.; Colyer, K.E.; Metz, R.; Pawlow, A.; Wischow, E.D.; Webb, I.; Andriole, E.J.; Poutsma, J.C.,
Gas-phase Acities of the 20 Protein Amino Acids,
Int. J. Mass Spectrom., 2007, 267, 1-3, 54-62, https://doi.org/10.1016/j.ijms.2007.02.018
. [all data]
O'Hair, Bowie, et al., 1992
O'Hair, R.J.; Bowie, J.H.; Gronert, S.,
Gas Phase Acidity of the alpha-Amino Acids,
Int. J. Mass Spectrom. Ion Proc., 1992, 117, 23, https://doi.org/10.1016/0168-1176(92)80083-D
. [all data]