Naphtho[2,3-f]quinoline-7,12-dione, 5,6-dihydroxy-
- Formula: C17H9NO4
- Molecular weight: 291.2577
- IUPAC Standard InChIKey: JROURLWMOZCGJV-UHFFFAOYSA-N
- CAS Registry Number: 568-02-5
- Chemical structure:
View 3d structure (requires JavaScript / HTML 5) - Permanent link for this species. Use this link for bookmarking this species for future reference.

Gas phase ion energetics data

Data compiled by: Henry M. Rosenstock, Keith Draxl, Bruce W. Steiner, and John T. Herron
Ionization energy determinations
IE (eV) | Method | Reference |
---|---|---|
7.35 | PI | Terenin, 1961 |

References

Terenin, 1961
Terenin, A.,
Charge transfer in organic solids, induced by light,
Proc. Chem. Soc., London, 1961, 321. [all data]