Benzene, (2,2-dimethyl-1-methylenepropyl)-
- Formula: C12H16
- Molecular weight: 160.2554
- IUPAC Standard InChIKey: OJHQXSRIBZMCSR-UHFFFAOYSA-N
- CAS Registry Number: 5676-29-9
- Chemical structure:
View 3d structure (requires JavaScript / HTML 5) - Other names: Styrene, α-tert-butyl-; α-tert-Butylstyrene; 1-tert-Butyl-1-phenylethylene; 3,3-Dimethyl-2-phenylbutene

Phase change data

Data compiled by: William E. Acree, Jr., James S. Chickos
Quantity | Value | Units | Method | Reference | Comment |
---|---|---|---|---|---|
ΔvapH° | 53.2 ± 0.1 | kJ/mol | GS | Verevkin and Ebenhoch, 1999 | Based on data from 298. to 318. K. |

Gas phase ion energetics data

Data evaluated as indicated in comments:
HL - Edward P. Hunter and Sharon G. Lias
Data compiled as indicated in comments:
LLK - Sharon G. Lias, Rhoda D. Levin, and Sherif A. Kafafi
Quantity | Value | Units | Method | Reference | Comment |
---|---|---|---|---|---|
Proton affinity (review) | 859.2 | kJ/mol | N/A | Hunter and Lias, 1998 | HL |
Quantity | Value | Units | Method | Reference | Comment |
Gas basicity | 830.3 | kJ/mol | N/A | Hunter and Lias, 1998 | HL |
Ionization energy determinations
IE (eV) | Method | Reference | Comment |
---|---|---|---|
8.25 ± 0.04 | EI | Benito, Seidl, et al., 1973 | LLK |

References

Verevkin and Ebenhoch, 1999
Verevkin, Sergey P.; Ebenhoch, Jochen,
Structural Chemistry, 1999, 10, 6, 401-409, https://doi.org/10.1023/A:1022470804409
. [all data]
Hunter and Lias, 1998
Hunter, E.P.; Lias, S.G.,
Evaluated Gas Phase Basicities and Proton Affinities of Molecules: An Update,
J. Phys. Chem. Ref. Data, 1998, 27, 3, 413-656, https://doi.org/10.1063/1.556018
. [all data]
Benito, Seidl, et al., 1973
Benito, I.; Seidl, H.; Bock, H.,
Efectos electronicos y estericos de sustituyentes alquilicos y silicicos sobre el sistema electronico π del estireno,
Rev. Fac. Cienc. Univ. Oviedo, 1973, 14, 95. [all data]