1,3-Nonadiene, (E)-
- Formula: C9H16
- Molecular weight: 124.2233
- IUPAC Standard InChIKey: CLNYHERYALISIR-FNORWQNLSA-N
- CAS Registry Number: 56700-77-7
- Chemical structure:
View 3d structure (requires JavaScript / HTML 5) - Stereoisomers:
- Other names: (E)-n-C5H11CH=CHCH=CH2; (E)-1,3-Nonadiene; (3E)-1,3-Nonadiene; 1,trans-3-Nonadiene; trans-1,3-Nonadiene

Gas phase ion energetics data

Data compiled as indicated in comments:
LLK - Sharon G. Lias, Rhoda D. Levin, and Sherif A. Kafafi
Ionization energy determinations
IE (eV) | Method | Reference | Comment |
---|---|---|---|
8.44 | PE | Masclet, Mouvier, et al., 1981 | LLK |

Kovats' RI, non-polar column, isothermal

Column type | Active phase | Temperature (C) | I | Reference | Comment |
---|---|---|---|---|---|
Capillary | Squalane | 70. | 909.7 | Soják, Král'ovicová, et al., 1984 | 195. m/0.25 mm/0.08 μm, H2 |

Van Den Dool and Kratz RI, polar column, temperature ramp

Column type | Active phase | I | Reference | Comment |
---|---|---|---|---|
Capillary | CP-WAX 57CB | 1047. | Salter L.J., Mottram D.S., et al., 1988 | 60. C @ 5. min, 4. K/min; Column length: 50. m; Column diameter: 0.32 mm; Tend: 200. C |

Normal alkane RI, non-polar column, temperature ramp

Column type | Active phase | I | Reference | Comment |
---|---|---|---|---|
Capillary | HP-5 | 924. | Piyachaiseth, Jirapakkul, et al., 2011 | 60. m/0.25 mm/0.25 μm, Helium, 35. C @ 1. min, 10. K/min, 220. C @ 15. min |

Normal alkane RI, polar column, temperature ramp

Column type | Active phase | I | Reference | Comment |
---|---|---|---|---|
Capillary | TC-Wax | 1045. | Miyazawa, Teranishi, et al., 2003 | He, 3. K/min; Column length: 60. m; Column diameter: 0.25 mm; Tstart: 80. C; Tend: 240. C |
Capillary | DB-Wax | 1046. | Horiuchi, Umano, et al., 1998 | 60. m/0.25 mm/1. μm, He, 3. K/min, 200. C @ 40. min; Tstart: 50. C |

References

Masclet, Mouvier, et al., 1981
Masclet, P.; Mouvier, G.; Bocquet, J.F.,
Effets electroniques et effets steriques dus a la substitution alcoyle dans les dienes conjugues,
J. Chim. Phys., 1981, 78, 99. [all data]
Soják, Král'ovicová, et al., 1984
Soják, L.; Král'ovicová, E.; Ostrovský, I.; Leclercq, P.A.,
Retention behaviour of conjegated and isolated n-alkadienes. Identification of n-nona- and n-decadiens by capillary gas chromatography using structure-retention correlations and mass spectrometry,
J. Chromatogr., 1984, 292, 1, 241-261, https://doi.org/10.1016/S0021-9673(01)96207-7
. [all data]
Salter L.J., Mottram D.S., et al., 1988
Salter L.J.; Mottram D.S.; Whitfield,
Volatile compounds produces in Maillard reactions involving glycine, ribose and phospholid,
J. Sci. Food Agric., 1988, 46, 2, 227-242, https://doi.org/10.1002/jsfa.2740460211
. [all data]
Piyachaiseth, Jirapakkul, et al., 2011
Piyachaiseth, T.; Jirapakkul, W.; Chaiseri, S.,
Aroma compounds of flash-fried rice,
Kasetsart J. (Nat. Sci.), 2011, 45, 717-729. [all data]
Miyazawa, Teranishi, et al., 2003
Miyazawa, M.; Teranishi, A.; Ishikawa, Y.,
Components of the essential oil from Petasites japonicus,
Flavour Fragr. J., 2003, 18, 3, 231-233, https://doi.org/10.1002/ffj.1203
. [all data]
Horiuchi, Umano, et al., 1998
Horiuchi, M.; Umano, K.; Shibamoto, T.,
Analysis of volatile compounds formed from fish oil heated with cysteine and trimethylamine oxide,
J. Agric. Food Chem., 1998, 46, 12, 5232-5237, https://doi.org/10.1021/jf980482m
. [all data]