CH3ON(CH3)2
- Formula: C3H9NO
- Molecular weight: 75.1097
- IUPAC Standard InChIKey: QVDVENIYNXDSOK-UHFFFAOYSA-N
- CAS Registry Number: 5669-39-6
- Chemical structure:
View 3d structure (requires JavaScript / HTML 5) - Other names: Trimethylhydroxylamine; N,N-Dimethylmethoxylamine; N,N,O-Trimethyl-hydroxylamine

Phase change data

Data compiled by: William E. Acree, Jr., James S. Chickos
Enthalpy of vaporization
ΔvapH (kJ/mol) | Temperature (K) | Method | Reference | Comment |
---|---|---|---|---|
28. | 282. | A | Stephenson and Malanowski, 1987 | Based on data from 194. to 297. K. See also Bissot, Parry, et al., 1957. |

Gas phase ion energetics data

Data compiled as indicated in comments:
LBLHLM - Sharon G. Lias, John E. Bartmess, Joel F. Liebman, John L. Holmes, Rhoda D. Levin, and W. Gary Mallard
LLK - Sharon G. Lias, Rhoda D. Levin, and Sherif A. Kafafi
Ionization energy determinations
IE (eV) | Method | Reference | Comment |
---|---|---|---|
8.78 | PE | Molder, Pikver, et al., 1983 | Vertical value; LBLHLM |
Appearance energy determinations
Ion | AE (eV) | Other Products | Method | Reference | Comment |
---|---|---|---|---|---|
C3H9NO+ | 8.81 | ? | PE | Rademacher and Freckmann, 1980 | Vertical value; LLK |

References

Stephenson and Malanowski, 1987
Stephenson, Richard M.; Malanowski, Stanislaw,
Handbook of the Thermodynamics of Organic Compounds, 1987, https://doi.org/10.1007/978-94-009-3173-2
. [all data]
Bissot, Parry, et al., 1957
Bissot, T.C.; Parry, R.W.; Campbell, D.H.,
The Physical and Chemical Properties of the Methylhydroxylamines 1,
J. Am. Chem. Soc., 1957, 79, 4, 796-800, https://doi.org/10.1021/ja01561a005
. [all data]
Molder, Pikver, et al., 1983
Molder, U.H.; Pikver, R.J.; Koppel, I.A.,
Photoelectron spectra of molecules. 2. Ethers,
Org. React. (N.Y. Engl. Transl.), 1983, 20, 208. [all data]
Rademacher and Freckmann, 1980
Rademacher, P.; Freckmann, B.,
Photoelektronen spektren und Konformations-verhalten von Hydroxylamin und Methylhydroxylaminen,
J. Electron Spectrosc. Relat. Phenom., 1980, 19, 251. [all data]