Allopregnane-3α,20α-diol
- Formula: C21H36O2
- Molecular weight: 320.5093
- IUPAC Standard InChIKey: YWYQTGBBEZQBGO-MCUCGFDHSA-N
- CAS Registry Number: 566-58-5
- Chemical structure:
- Other names: Pregnane-3,20-diol, (3α,5α,20S)-; 5α-Pregnane-3α,20α-diol; Allopregnanediol; 3α,20α-Dihydroxy-5α-pregnane; 5α-Pregnanediol; Pregnane-3,20-diol, (3α,5α,20α)-; 5.beta.-Pregnane-3.alpha.,20.alpha.-diol; Pregnane-3,20-diol; Pregnan-3A,20A-diol

Van Den Dool and Kratz RI, non-polar column, custom temperature program

Column type | Active phase | I | Reference | Comment |
---|---|---|---|---|
Capillary | VF-5MS | 2803.5 | Tret'yakov, 2008 | 30. m/0.25 mm/0.25 μm, He; Program: Multi-step temperature program; T(initial)=60C; T(final)=270C |

Normal alkane RI, non-polar column, isothermal

Column type | Active phase | Temperature (C) | I | Reference | Comment |
---|---|---|---|---|---|
Capillary | OV-101 | 230. | 2769. | Krupcik, Rutten, et al., 1976 | Column length: 30. m; Column diameter: 0.25 mm |
Capillary | OV-101 | 230. | 2770. | Krupcik, Rutten, et al., 1976 | Column length: 30. m; Column diameter: 0.25 mm |

References

Tret'yakov, 2008
Tret'yakov, K.V.,
Retention Data. NIST Mass Spectrometry Data Center., NIST Mass Spectrometry Data Center, 2008. [all data]
Krupcik, Rutten, et al., 1976
Krupcik, J.; Rutten, G.A.F.M.; Rijks, J.A.,
The influence of temperature on the separation and characterization of steroids on non-polar glass capillary columns,
Chem. zvesti, 1976, 30, 4, 469-479. [all data]