1H-1,2,4-Triazole,5-chloro-1,3-dimethyl-
- Formula: C4H6ClN3
- Molecular weight: 131.564
- IUPAC Standard InChIKey: VASAIVDULFBVCG-UHFFFAOYSA-N
- CAS Registry Number: 56616-97-8
- Chemical structure:
View 3d structure (requires JavaScript / HTML 5) - Permanent link for this species. Use this link for bookmarking this species for future reference.

Gas phase ion energetics data

Data compiled by: Sharon G. Lias, Rhoda D. Levin, and Sherif A. Kafafi
Ionization energy determinations
IE (eV) | Method | Reference | Comment |
---|---|---|---|
9.35 | PE | Guimon, Pfister-Guillouzo, et al., 1980 | Vertical value |

References

Guimon, Pfister-Guillouzo, et al., 1980
Guimon, C.; Pfister-Guillouzo, G.; Bernardini, A.; Viallefont, P.,
A photoelectron study (HeI, HeII) of the tautomeric equilibrium of chloro- and bromo-1,2,4-triazoles,
Tetrahedron, 1980, 36, 1071. [all data]