2-Pentanone, 3-methyl-
- Formula: C6H12O
- Molecular weight: 100.1589
- IUPAC Standard InChIKey: UIHCLUNTQKBZGK-UHFFFAOYSA-N
- CAS Registry Number: 565-61-7
- Chemical structure:
View 3d structure (requires JavaScript / HTML 5) - Other names: sec-Butyl Methyl ketone; Methyl sec-butyl ketone; Methyl 1-methylpropyl ketone; 3-Methyl-2-pentanone; sec-C4H9COCH3; 3-Methylpentan-2-one

Gas phase thermochemistry data

Data compiled as indicated in comments:
ALS - Hussein Y. Afeefy, Joel F. Liebman, and Stephen E. Stein
GT - Glushko Thermocenter, Russian Academy of Sciences, Moscow
Quantity | Value | Units | Method | Reference | Comment |
---|---|---|---|---|---|
ΔfH°gas | -284.1 ± 1.3 | kJ/mol | Ccb | Dubois and Herzog, 1972 | ALS |
Constant pressure heat capacity of gas
Cp,gas (J/mol*K) | Temperature (K) | Reference | Comment |
---|---|---|---|
182.46 ± 0.27 | 395.25 | von Geiseler G., 1973 | GT |
183.72 ± 0.28 | 399.65 | ||
184.97 ± 0.28 | 403.75 | ||
187.36 ± 0.28 | 411.35 | ||
188.66 ± 0.28 | 416.25 |

Reaction thermochemistry data

Data compiled by: Hussein Y. Afeefy, Joel F. Liebman, and Stephen E. Stein
Individual Reactions
By formula: C8H18O2 + H2O = C6H12O + 2CH4O
Quantity | Value | Units | Method | Reference | Comment |
---|---|---|---|---|---|
ΔrH° | 19.92 ± 0.046 | kJ/mol | Cm | Wiberg and Squires, 1979 | liquid phase; Heat of hydrolysis |

Gas phase ion energetics data

Data evaluated as indicated in comments:
L - Sharon G. Lias
Data compiled as indicated in comments:
LBLHLM - Sharon G. Lias, John E. Bartmess, Joel F. Liebman, John L. Holmes, Rhoda D. Levin, and W. Gary Mallard
LLK - Sharon G. Lias, Rhoda D. Levin, and Sherif A. Kafafi
RDSH - Henry M. Rosenstock, Keith Draxl, Bruce W. Steiner, and John T. Herron
Quantity | Value | Units | Method | Reference | Comment |
---|---|---|---|---|---|
IE (evaluated) | 9.21 ± 0.01 | eV | N/A | N/A | L |
Ionization energy determinations
IE (eV) | Method | Reference | Comment |
---|---|---|---|
9.20 ± 0.05 | EI | Bouchoux, Flammang, et al., 1984 | LBLHLM |
9.22 | EI | Holmes, Fingas, et al., 1981 | LLK |
9.209 ± 0.005 | PE | Hernandez, Masclet, et al., 1977 | LLK |
9.69 | EI | Hatada and Hirota, 1965 | RDSH |
Appearance energy determinations
Ion | AE (eV) | Other Products | Method | Reference | Comment |
---|---|---|---|---|---|
C4H8O+ | 9.52 | C2H4 | EI | Holmes and Lossing, 1980 | LLK |
C4H9+ | 10.78 ± 0.05 | CH3CO | EI | Holmes and Lossing, 1984 | LBLHLM |

Phase change data

Data compiled as indicated in comments:
BS - Robert L. Brown and Stephen E. Stein
TRC - Thermodynamics Research Center, NIST Boulder Laboratories, Chris Muzny director
AC - William E. Acree, Jr., James S. Chickos
Quantity | Value | Units | Method | Reference | Comment |
---|---|---|---|---|---|
Tboil | 390. ± 2. | K | AVG | N/A | Average of 20 values; Individual data points |
Quantity | Value | Units | Method | Reference | Comment |
Tc | 571.9 | K | N/A | Majer and Svoboda, 1985 | |
Quantity | Value | Units | Method | Reference | Comment |
ΔvapH° | 9.701 | kcal/mol | N/A | Majer and Svoboda, 1985 | |
ΔvapH° | 9.92 | kcal/mol | A | Stephenson and Malanowski, 1987 | Based on data from 283. to 395. K.; AC |
ΔvapH° | 9.85 | kcal/mol | N/A | Ambrose, Ellender, et al., 1975 | Based on data from 283. to 457. K.; AC |
Reduced pressure boiling point
Tboil (K) | Pressure (atm) | Reference | Comment |
---|---|---|---|
391.2 | 0.997 | Aldrich Chemical Company Inc., 1990 | BS |
Enthalpy of vaporization
ΔvapH (kcal/mol) | Temperature (K) | Method | Reference | Comment |
---|---|---|---|---|
8.164 | 390.6 | N/A | Majer and Svoboda, 1985 | |
9.51 | 301. | A | Stephenson and Malanowski, 1987 | Based on data from 286. to 400. K.; AC |
8.72 | 400. | A | Stephenson and Malanowski, 1987 | Based on data from 385. to 455. K.; AC |
Enthalpy of vaporization
ΔvapH =
A exp(-βTr) (1 − Tr)β
ΔvapH =
Enthalpy of vaporization (at saturation pressure)
(kcal/mol)
Tr = reduced temperature (T / Tc)
View plot Requires a JavaScript / HTML 5 canvas capable browser.
Temperature (K) | A (kcal/mol) | β | Tc (K) | Reference | Comment |
---|---|---|---|---|---|
348. to 390. | 14. | 0.2984 | 571.9 | Majer and Svoboda, 1985 |

Van Den Dool and Kratz RI, polar column, temperature ramp

Data compiled by: NIST Mass Spectrometry Data Center, William E. Wallace, director

Column type CapillaryCapillaryCapillaryCapillaryCapillary
Active phase ZB-WaxCP-Wax 52CBDB-WaxSupelcowax-10Supelcowax-10
Column length (m) 30.60.60.60.60.
Carrier gas He He
Substrate
Column diameter (mm) 0.250.250.250.250.25
Phase thickness (μm) 0.150.250.250.250.25
Tstart (C) 35.35.50.40.40.
Tend (C) 220.203.230.175.175.
Heat rate (K/min) 5.3.3.2.2.
Initial hold (min) 5.4. 5.5.
Final hold (min) 10.  20.20.
I 1067.1011.1016.1016.1019.
ReferenceLedauphin, Basset, et al., 2006Alasalvar, Taylor, et al., 2005Shimoda, Peralta, et al., 1996Tanchotikul and Hsieh, 1989Tanchotikul and Hsieh, 1989
Comment MSDC-RI MSDC-RI MSDC-RI MSDC-RI MSDC-RI

Van Den Dool and Kratz RI, non-polar column, custom temperature program

Data compiled by: NIST Mass Spectrometry Data Center, William E. Wallace, director

Column type CapillaryCapillary
Active phase DB-1BPX-5
Column length (m) 60.50.
Carrier gas HeHe
Substrate
Column diameter (mm) 0.320.32
Phase thickness (μm) 1.0.5
Program 35C(5min) => 10C/min => 45C (5min) => 5C/min => 250C (10min)OC => 60C/min => 60C(5min) => 4C/min => 250C(20min)
I 736.760.
ReferencePlace, Imhof, et al., 2003Owens J.D., Allagheny N., et al., 1997
Comment MSDC-RI MSDC-RI

Van Den Dool and Kratz RI, polar column, custom temperature program

Data compiled by: NIST Mass Spectrometry Data Center, William E. Wallace, director

Column type Capillary
Active phase CP-Wax 52CB
Column length (m) 60.
Carrier gas He
Substrate
Column diameter (mm) 0.25
Phase thickness (μm) 0.25
Program 40C => 5C/min => 60C => 2.5C/min => 155C
I 1013.
ReferenceAlasalvar, Shahidi, et al., 2003
Comment MSDC-RI

Normal alkane RI, non-polar column, temperature ramp

Data compiled by: NIST Mass Spectrometry Data Center, William E. Wallace, director

Column type CapillaryCapillaryCapillaryCapillaryCapillary
Active phase Optima-5 MSBPX-5HP-5DB-5HP-5
Column length (m) 30. 60.30.
Carrier gas Helium He
Substrate
Column diameter (mm) 0.25 0.320.32
Phase thickness (μm) 0.25 1.1.
Tstart (C) 35.40.40.40.35.
Tend (C) 250.260.240.200.200.
Heat rate (K/min) 10.5.3.3.6.
Initial hold (min) 3.  5.2.
Final hold (min) 5.
I 743.759.752.753.750.
ReferenceGoeminne, Vandendriessche, et al., 2012Diaz and Kite, 2002García, Martín, et al., 2000Meynier, Novelli, et al., 1999Larsen and Frisvad, 1995
Comment MSDC-RI MSDC-RI MSDC-RI MSDC-RI MSDC-RI

References

Dubois and Herzog, 1972
Dubois, J.-E.; Herzog, H.,
Heats of formation of aliphatic ketones: Structure correlation based on environment treatment,
J. Chem. Soc. Chem. Commun., 1972, 932-933. [all data]
von Geiseler G., 1973
von Geiseler G.,
The heat capacity and the heat of vaporization of isomeric butylmethylketones and propylacetates,
Z. Phys. Chem. (Leipzig), 1973, 252, 170-176. [all data]
Wiberg and Squires, 1979
Wiberg, K.B.; Squires, R.R.,
Thermodynamics of hydrolysis aliphatic ketals. An entropy component of steric effects,
J. Am. Chem. Soc., 1979, 101, 5512-5515. [all data]
Bouchoux, Flammang, et al., 1984
Bouchoux, G.; Flammang, R.; Hoppilliard, Y.; Jaudon, P.; Maquestiau, A.; Meyrant, P.,
Mecanismes de formation des ions [C5H9O]+ a partir des cetones [CH3COC4H9]+,
Spectroscopy Ottawa, 1984, 3, 1. [all data]
Holmes, Fingas, et al., 1981
Holmes, J.L.; Fingas, M.; Lossing, F.P.,
Towards a general scheme for estimating the heats of formation of organic ions in the gas phase. Part I. Odd-electron cations,
Can. J. Chem., 1981, 59, 80. [all data]
Hernandez, Masclet, et al., 1977
Hernandez, R.; Masclet, P.; Mouvier, G.,
Spectroscopie de photoelectrons d'aldehydes et de cetones aliphatiques,
J. Electron Spectrosc. Relat. Phenom., 1977, 10, 333. [all data]
Hatada and Hirota, 1965
Hatada, M.; Hirota, K.,
The ionization and dissociation of aliphatic ketones under electron impact. II. Methyl-sec-butylketone and methyl-tert-butylketone,
Z. Physik. Chem. (Frankfurt), 1965, 44, 328. [all data]
Holmes and Lossing, 1980
Holmes, J.L.; Lossing, F.P.,
Gas-phase heats of formation of keto and enol ions of carbonyl compounds.,
J. Am. Chem. Soc., 1980, 102, 1591. [all data]
Holmes and Lossing, 1984
Holmes, J.L.; Lossing, F.P.,
Heats of formation of organic radicals from appearance energies,
Int. J. Mass Spectrom. Ion Processes, 1984, 58, 113. [all data]