3,6-Cycloheptadiene-1,2,5-trione
- Formula: C7H4O3
- Molecular weight: 136.1049
- IUPAC Standard InChIKey: SNVPKVKSGSWSRB-UHFFFAOYSA-N
- CAS Registry Number: 56561-57-0
- Chemical structure:
View 3d structure (requires JavaScript / HTML 5) - Permanent link for this species. Use this link for bookmarking this species for future reference.

Gas phase ion energetics data

Data compiled by: Sharon G. Lias, John E. Bartmess, Joel F. Liebman, John L. Holmes, Rhoda D. Levin, and W. Gary Mallard
Ionization energy determinations
IE (eV) | Method | Reference | Comment |
---|---|---|---|
9.53 | PE | Gleiter, Dobler, et al., 1982 | |
9.98 | PE | Gleiter, Dobler, et al., 1982 | Vertical value |

References

Gleiter, Dobler, et al., 1982
Gleiter, R.; Dobler, W.; Eckert-Maksic, M.,
The electronic structure of o-tropoquinone, p-tropoquinone, and cyclopentene-1,2,3-trione - PE spectroscopic investigations,
Nouv. J. Chim., 1982, 6, 123. [all data]