Benz[a]anthracene
- Formula: C18H12
- Molecular weight: 228.2879
- IUPAC Standard InChIKey: DXBHBZVCASKNBY-UHFFFAOYSA-N
- CAS Registry Number: 56-55-3
- Chemical structure:
View 3d structure (requires JavaScript / HTML 5) - Other names: Benzanthracene; Benzanthrene; Benzoanthracene; Benzo[a]anthracene; Benzo[b]phenanthrene; Tetraphene; 1,2-Benzanthracene; 1,2-Benzanthrene; 1,2-Benzoanthracene; 1,2-Benz[a]anthracene; 2,3-Benzophenanthrene; BA; 1,2-Benzanthrazen; 2,3-Benzphenanthrene; Rcra waste number U018; NSC 30970

Gas phase thermochemistry data

Data compiled as indicated in comments:
DRB - Donald R. Burgess, Jr.
GT - Glushko Thermocenter, Russian Academy of Sciences, Moscow
Quantity | Value | Units | Method | Reference | Comment |
---|---|---|---|---|---|
ΔfH°gas | 69.4 ± 1.4 | kcal/mol | Review | Roux, Temprado, et al., 2008 | There are insufficient literature values to properly evaluate the data and insufficient information to construct thermochemical cycles or estimate values for comparison, and one must rely solely upon reported uncertainities and the quality of the measurements. In general, the evaluated uncertainty limits are on the order of (3 to 9) kJ/mol.; DRB |
Constant pressure heat capacity of gas
Cp,gas (cal/mol*K) | Temperature (K) | Reference | Comment |
---|---|---|---|
11.73 | 50. | Dorofeeva O.V., 1988 | Recommended values were calculated statistically mechanically using force field approximation for polycyclic aromatic hydrocarbons to estimate the needed vibrational frequencies (see also [ Dorofeeva O.V., 1986, Moiseeva N.F., 1989]). These functions are reproduced in the reference book [ Frenkel M., 1994].; GT |
18.41 | 100. | ||
26.561 | 150. | ||
35.961 | 200. | ||
50.865 | 273.15 | ||
55.99 ± 0.36 | 298.15 | ||
56.370 | 300. | ||
75.571 | 400. | ||
91.585 | 500. | ||
104.38 | 600. | ||
114.60 | 700. | ||
122.87 | 800. | ||
129.65 | 900. | ||
135.29 | 1000. | ||
140.02 | 1100. | ||
144.01 | 1200. | ||
147.41 | 1300. | ||
150.31 | 1400. | ||
152.81 | 1500. |

Condensed phase thermochemistry data

Data compiled as indicated in comments:
DRB - Donald R. Burgess, Jr.
ALS - Hussein Y. Afeefy, Joel F. Liebman, and Stephen E. Stein
DH - Eugene S. Domalski and Elizabeth D. Hearing
Quantity | Value | Units | Method | Reference | Comment |
---|---|---|---|---|---|
ΔfH°solid | 40.82 ± 0.79 | kcal/mol | Review | Roux, Temprado, et al., 2008 | There are insufficient literature values to properly evaluate the data and insufficient information to construct thermochemical cycles or estimate values for comparison, and one must rely solely upon reported uncertainities and the quality of the measurements. In general, the evaluated uncertainty limits are on the order of (3 to 9) kJ/mol.; DRB |
Quantity | Value | Units | Method | Reference | Comment |
ΔcH°solid | -2143.64 ± 0.56 | kcal/mol | Ccb | Magnus, Hartmann, et al., 1951 | Reanalyzed by Cox and Pilcher, 1970, Original value = -2143.74 ± 0.56 kcal/mol; Corresponding ΔfHºsolid = 40.83 kcal/mol (simple calculation by NIST; no Washburn corrections); ALS |
Constant pressure heat capacity of solid
Cp,solid (cal/mol*K) | Temperature (K) | Reference | Comment |
---|---|---|---|
65.39 | 298.15 | Ueberreiter and Orthmann, 1950 | T = 293 to 368 K. Equation only.; DH |

Phase change data

Data compiled as indicated in comments:
BS - Robert L. Brown and Stephen E. Stein
TRC - Thermodynamics Research Center, NIST Boulder Laboratories, Chris Muzny director
AC - William E. Acree, Jr., James S. Chickos
DRB - Donald R. Burgess, Jr.
ALS - Hussein Y. Afeefy, Joel F. Liebman, and Stephen E. Stein
Quantity | Value | Units | Method | Reference | Comment |
---|---|---|---|---|---|
Tboil | 710.8 | K | N/A | Aldrich Chemical Company Inc., 1990 | BS |
Tboil | 710.8 | K | N/A | Wakayama and Inokuchi, 1967 | Uncertainty assigned by TRC = 2. K; TRC |
Tboil | 710.7 | K | N/A | Franck, 1955 | Uncertainty assigned by TRC = 2. K; TRC |
Tboil | 710.8 | K | N/A | Kruber, Raeithel, et al., 1955 | Uncertainty assigned by TRC = 2. K; TRC |
Tboil | 710.7 | K | N/A | Kruber and Grigoleit, 1954 | Uncertainty assigned by TRC = 2. K; TRC |
Quantity | Value | Units | Method | Reference | Comment |
Tfus | 432. ± 3. | K | AVG | N/A | Average of 8 values; Individual data points |
Quantity | Value | Units | Method | Reference | Comment |
ΔvapH° | 25.29 ± 0.45 | kcal/mol | CGC | Hanshaw, Nutt, et al., 2008 | AC |
ΔvapH° | 23.1 ± 0.33 | kcal/mol | GC | Haftka, Parsons, et al., 2006 | Based on data from 463. to 525. K.; AC |
Quantity | Value | Units | Method | Reference | Comment |
ΔsubH° | 28.6 ± 1.2 | kcal/mol | Review | Roux, Temprado, et al., 2008 | There are sufficient literature values to make a qualified recommendation where the suggested value is in good agreement with values predicted using thermochemical cycles or from reliable estimates. In general, the evaluated uncertainty limits are on the order of (2 to 4) kJ/mol.; DRB |
ΔsubH° | 29.5 ± 0.7 | kcal/mol | V | Kruif, 1980 | ALS |
ΔsubH° | 29.5 ± 0.7 | kcal/mol | N/A | Kruif, 1980 | Based on data from 373. to 396. K.; AC |
ΔsubH° | 28.8 | kcal/mol | V | Wakayama and Inokuchi, 1967, 2 | ALS |
Enthalpy of vaporization
ΔvapH (kcal/mol) | Temperature (K) | Method | Reference | Comment |
---|---|---|---|---|
21.7 | 398. | GC | Hinckley, Bidleman, et al., 1990 | Based on data from 343. to 453. K.; AC |
Enthalpy of sublimation
ΔsubH (kcal/mol) | Temperature (K) | Method | Reference | Comment |
---|---|---|---|---|
27.61 | 383. | GS | Nass, Lenoir, et al., 1995 | Based on data from 313. to 453. K.; AC |
27.10 | 345. | ME | Stephenson and Malanowski, 1987 | Based on data from 330. to 390. K. See also Murray, Pottie, et al., 1974.; AC |
24.9 ± 0.5 | 351. | TE | Ferro, Imperatori, et al., 1983 | AC |
28.80 | 405. | ME | Wakayama and Inokuchi, 1967, 3 | Based on data from 357. to 454. K.; AC |
24.99 | 377. | V | Kelley and Rice, 1964 | ALS |
25.0 ± 1.0 | 390. | ME | Kelley and Rice, 1964, 2 | Based on data from 377. to 403. K. See also Stephenson and Malanowski, 1987.; AC |
28.61 | 363. | N/A | Hoyer and Peperle, 1958 | Based on data from 333. to 393. K.; AC |
27.9 | 333. | V | Hoyer and Peperle, 1958, 2 | ALS |
26.1 | 293. | V | Magnus, Hartmann, et al., 1951 | ALS |
Enthalpy of fusion
ΔfusH (kcal/mol) | Temperature (K) | Method | Reference | Comment |
---|---|---|---|---|
4.80 | 433.5 | DSC | Kestens, Auclair, et al., 2010 | AC |
5.110 | 434.3 | N/A | Acree, 1991 | AC |

Gas phase ion energetics data

Data evaluated as indicated in comments:
L - Sharon G. Lias
Data compiled as indicated in comments:
LLK - Sharon G. Lias, Rhoda D. Levin, and Sherif A. Kafafi
RDSH - Henry M. Rosenstock, Keith Draxl, Bruce W. Steiner, and John T. Herron
B - John E. Bartmess
Quantity | Value | Units | Method | Reference | Comment |
---|---|---|---|---|---|
IE (evaluated) | 7.45 ± 0.05 | eV | N/A | N/A | L |
Electron affinity determinations
EA (eV) | Method | Reference | Comment |
---|---|---|---|
0.39 ± 0.10 | CIDC | Chen and Cooks, 1995 | B |
0.6300 ± 0.0080 | ECD | Becker and Chen, 1966 | B |
0.460008 | ECD | Wentworth and Becker, 1962 | B |
Ionization energy determinations
IE (eV) | Method | Reference | Comment |
---|---|---|---|
7.5 ± 0.3 | EI | Wacks, 1964 | RDSH |
7.52 | CTS | Kuroda, 1964 | RDSH |
7.53 | CTS | Briegleb, 1964 | RDSH |
7.56 | CTS | Kinoshita, 1962 | RDSH |
7.5 | CTS | Briegleb, Czekalla, et al., 1961 | RDSH |
7.45 | CTS | Birks and Stifkin, 1961 | RDSH |
7.6 | CTS | Briegleb and Czekalla, 1959 | RDSH |
7.35 | CTS | Matsen, 1956 | RDSH |
7.46 ± 0.03 | PE | Akiyama, Harvey, et al., 1981 | Vertical value; LLK |
7.41 ± 0.02 | PE | Schmidt, 1977 | Vertical value; LLK |
7.41 | PE | Clar and Schmidt, 1976 | Vertical value; LLK |
7.56 ± 0.01 | PE | Dewar and Goodman, 1972 | Vertical value; LLK |
7.42 | PE | Brogli and Heilbronner, 1972 | Vertical value; LLK |
7.47 ± 0.01 | PE | Boschi, Murrell, et al., 1972 | Vertical value; LLK |

Van Den Dool and Kratz RI, non-polar column, temperature ramp

Column type | Active phase | I | Reference | Comment |
---|---|---|---|---|
Capillary | Ultra-1 | 2433.59 | Richmond and Pombo-Villar, 1997 | 25. m/0.32 mm/0.52 μm, 15. K/min, 320. C @ 10. min; Tstart: 35. C |
Capillary | OV-1 | 2432.8 | Gautzsch and Zinn, 1996 | 8. K/min; Tstart: 35. C; Tend: 300. C |
Capillary | SE-52 | 2400. | Beernaert, 1979 | He, 50. C @ 5. min, 6. K/min; Column length: 33.3 m; Column diameter: 0.50 mm; Tend: 320. C |
Capillary | SE-52 | 2389. | Carugno and Rossi, 1967 | N2, 1.8 K/min; Column length: 65. m; Column diameter: 0.3 mm; Tstart: 100. C; Tend: 300. C |

Van Den Dool and Kratz RI, non-polar column, custom temperature program

Column type | Active phase | I | Reference | Comment |
---|---|---|---|---|
Capillary | OV-101 | 2403. | Yasuhara, Shiraishi, et al., 1997 | 15. m/0.25 mm/0.25 μm, He; Program: 50C(2min) => (20C/min) => 120C => (7C/min) => 310C(10min) |
Capillary | 5 % Phenyl methyl siloxane | 2423. | Yasuhara, Shiraishi, et al., 1997 | 25. m/0.31 mm/0.52 μm, He; Program: 50C(2min) => (20C/min) => 120C => (7C/min) => 310C(10min) |
Capillary | Methyl Silicone | 2393. | Oda, Ichikawa, et al., 1996 | Program: 50C (2min) => 20C/min => 160C => 5C/min => 210C => 10C/min => 300C |

Normal alkane RI, non-polar column, temperature ramp

Column type | Active phase | I | Reference | Comment |
---|---|---|---|---|
Capillary | HP-5 | 2440. | Miao and Wu, 1999 | 30. m/0.32 mm/0.25 μm, 50. C @ 2. min, 5. K/min; Tend: 310. C |
Capillary | HP-5 | 2441. | Miao and Wu, 1999 | 30. m/0.32 mm/0.25 μm, 50. C @ 2. min, 5. K/min; Tend: 310. C |
Capillary | HP-5 | 2447. | Miao and Wu, 1999 | 30. m/0.32 mm/0.25 μm, 50. C @ 2. min, 5. K/min; Tend: 310. C |
Capillary | HP-5 | 2447. | Miao and Wu, 1999 | 30. m/0.32 mm/0.25 μm, 50. C @ 2. min, 5. K/min; Tend: 310. C |
Capillary | HP-5 | 2452. | Miao and Wu, 1999 | 30. m/0.32 mm/0.25 μm, 50. C @ 2. min, 5. K/min; Tend: 310. C |
Capillary | HP-5 | 2453. | Miao and Wu, 1999 | 30. m/0.32 mm/0.25 μm, 50. C @ 2. min, 5. K/min; Tend: 310. C |
Capillary | Ultra-1 | 2418. | Elizalde-González, Hutfliess, et al., 1996 | 50. m/0.2 mm/0.33 μm, H2, 3. K/min, 300. C @ 35. min; Tstart: 60. C |
Capillary | Ultra-1 | 2421. | Elizalde-González, Hutfliess, et al., 1996 | 50. m/0.2 mm/0.33 μm, H2, 3. K/min, 300. C @ 35. min; Tstart: 60. C |
Capillary | DB-5 | 2445. | Quilliam, Lant, et al., 1985 | 30. m/0.32 mm/0.1 μm, He, 10. K/min; Tstart: 60. C; Tend: 290. C |

Normal alkane RI, non-polar column, custom temperature program

Column type | Active phase | I | Reference | Comment |
---|---|---|---|---|
Capillary | Methyl Silicone | 2403. | Oda, Yasuhara, et al., 1998 | 25. m/0.25 mm/0.25 μm, He; Program: 50 0C (2 min) 20 0C/min -> 160 0C 5 0C/min -> 210 0C 10 0C/min -> 300 0C |
Lee's RI, non-polar column, isothermal
Column type | Active phase | Temperature (C) | I | Reference | Comment |
---|---|---|---|---|---|
Packed | Methyl Silicone | 200. | 398.96 | Shlyakhov, 1984 | |
Packed | Methyl Silicone | 200. | 401.97 | Shlyakhov, 1984 | |
Packed | Methyl Silicone | 235. | 399.22 | Shlyakhov, 1984 | |
Packed | Methyl Silicone | 240. | 399.00 | Shlyakhov, 1984 | |
Packed | Methyl Silicone | 260. | 399.71 | Shlyakhov, 1984 | |
Packed | Methyl Silicone | 300. | 400.00 | Shlyakhov, 1984 |

Lee's RI, non-polar column, temperature ramp

Column type | Active phase | I | Reference | Comment |
---|---|---|---|---|
Capillary | PE-5 | 398.2 | Jamoussi, Kanzari, et al., 2007 | 20. m/0.18 mm/0.18 μm, 50. C @ 1.5 min, 8. K/min; Tend: 345. C |
Capillary | 5 % Phenyl methyl siloxane | 398.50 | Skrbic and Onjia, 2006 | 2. K/min; Tstart: 50. C; Tend: 250. C |
Capillary | 5 % Phenyl methyl siloxane | 398.60 | Skrbic and Onjia, 2006 | 80. C @ 2. min, 8. K/min, 300. C @ 10. min |
Capillary | HP-5 | 398.60 | Pedersen, Durant, et al., 2005 | 30. m/0.25 mm/0.25 μm, Helium, 50. C @ 1.5 min, 6. K/min, 310. C @ 10. min |
Capillary | HP-5 | 398.69 | Marynowski, Pieta, et al., 2004 | 60. m/0.25 mm/0.25 μm, He, 3. K/min; Tstart: 35. C; Tend: 300. C |
Capillary | DB-5MS | 398.51 | Chen, Keeran, et al., 2002 | 30. m/0.25 mm/0.5 μm, 40. C @ 1. min, 10. K/min; Tend: 310. C |
Capillary | DB-5MS | 398.53 | Chen, Keeran, et al., 2002 | 30. m/0.25 mm/0.5 μm, 40. C @ 1. min, 4. K/min; Tend: 310. C |
Capillary | PTE-5 | 398.57 | Wang, Jia, et al., 2000 | 30. m/0.25 mm/0.25 μm, 60. C @ 1.5 min, 8. K/min, 300. C @ 12.5 min |
Capillary | HP-5 | 398.262 | Miao and Wu, 1999 | 50. C @ 2. min, 5. K/min; Tend: 310. C |
Capillary | HP-5 | 398.55 | Miao and Wu, 1999 | 50. C @ 2. min, 5. K/min; Tend: 310. C |
Capillary | HP-5 | 398.59 | Miao and Wu, 1999 | 50. C @ 2. min, 5. K/min; Tend: 310. C |
Capillary | HP-5 | 398.60 | Miao and Wu, 1999 | 50. C @ 2. min, 5. K/min; Tend: 310. C |
Capillary | HP-5 | 398.62 | Miao and Wu, 1999 | 50. C @ 2. min, 5. K/min; Tend: 310. C |
Capillary | HP-5 | 398.63 | Miao and Wu, 1999 | 50. C @ 2. min, 5. K/min; Tend: 310. C |
Capillary | HP-5 | 398.64 | Miao and Wu, 1999 | 50. C @ 2. min, 5. K/min; Tend: 310. C |
Capillary | HP-5 | 398.64 | Miao and Wu, 1999 | 50. C @ 2. min, 5. K/min; Tend: 310. C |
Capillary | HP-5 | 398.63 | Piao, Chu, et al., 1999 | 30. m/0.25 mm/0.25 μm, 50. C @ 2. min, 4. K/min, 280. C @ 20. min |
Capillary | HP-5 | 398.72 | Piao, Chu, et al., 1999 | 30. m/0.25 mm/0.25 μm, 50. C @ 2. min, 4. K/min, 280. C @ 20. min |
Capillary | SE-54 | 398.33 | Chen, 1996 | 4. K/min; Column length: 30. m; Column diameter: 0.25 mm; Tstart: 50. C; Tend: 300. C |
Capillary | SE-52 | 398.36 | Shaogang and Xiaobai, 1994 | 40. C @ 2. min, 4. K/min, 300. C @ 20. min; Column length: 30. m; Column diameter: 0.25 mm |
Capillary | DB-5 | 398.1 | Donnelly, Abdel-Hamid, et al., 1993 | 30. m/0.32 mm/0.25 μm, He, 40. C @ 3. min, 8. K/min, 285. C @ 29.5 min |
Capillary | SPB-5 | 398.5 | Knobloch and Engewald, 1993 | 40. C @ 2. min, 4. K/min; Column length: 30. m; Column diameter: 0.25 mm; Tend: 300. C |
Capillary | SE-54 | 398.22 | Guillén, Blanco, et al., 1989 | 20. m/0.22 mm/0.20 μm, He, 4. K/min; Tstart: 50. C; Tend: 300. C |
Capillary | SE-52 | 398.14 | Hasegawa, Muragishi, et al., 1988 | 3. K/min; Column length: 25. m; Column diameter: 0.25 mm; Tstart: 130. C; Tend: 260. C |
Capillary | DB-5 | 398.40 | Sye, Lin, et al., 1988 | 30. m/0.32 mm/0.25 μm, 80. C @ 1. min, 3. K/min; Tend: 290. C |
Capillary | DB-5 | 398.69 | Wise, Benner, et al., 1988 | 30. m/0.25 mm/0.25 μm, 40. C @ 2. min, 4. K/min, 280. C @ 5. min |
Capillary | SE-52 | 398.50 | Boenke and Ballschmiter, 1987 | Hydrogen, 3. K/min; Column length: 12. m; Tstart: 120. C; Tend: 285. C |
Capillary | DB-5 | 398.77 | Rostad and Pereira, 1986 | 30. m/0.26 mm/0.25 μm, He, 50. C @ 4. min, 6. K/min, 300. C @ 20. min |
Capillary | DB-5 | 398.6 | Quilliam, Lant, et al., 1985 | 30. m/0.32 mm/0.1 μm, He, 10. K/min; Tstart: 60. C; Tend: 290. C |
Capillary | DB-5 | 397.55 | Tong, Centen, et al., 1985 | He, 4. K/min; Column length: 30. m; Column diameter: 0.25 mm; Tstart: 90. C; Tend: 325. C |
Capillary | SE-52 | 398.76 | Vassilaros, Kong, et al., 1982 | 20. m/0.30 mm/0.25 μm, H2, 40. C @ 2. min, 4. K/min; Tend: 265. C |
Capillary | SE-52 | 398.50 | Lee, Vassilaros, et al., 1979 | 12. m/0.3 mm/0.34 μm, He, 2. K/min; Tstart: 50. C; Tend: 250. C |

Lee's RI, non-polar column, custom temperature program

Column type | Active phase | I | Reference | Comment |
---|---|---|---|---|
Capillary | DB-5 | 398.2 | Fuentes, Font, et al., 2007 | Column length: 60. m; Program: not specified |
Capillary | HP-5MS | 398.36 | Wang, Li, et al., 2007 | 30. m/0.25 mm/0.25 μm, He; Program: 60C(2min) => 6C/min => 258C => 2C/min => 300C(4min) |
Capillary | HP-5MS | 398.36 | Wang, Li, et al., 2007, 2 | 30. m/0.25 mm/0.25 μm, He; Program: not specified |
Capillary | HP-5MS | 398.69 | Wang, Li, et al., 2007, 2 | 30. m/0.25 mm/0.25 μm, He; Program: not specified |
Capillary | HP-5MS | 398.76 | Wang, Li, et al., 2007, 2 | 30. m/0.25 mm/0.25 μm, He; Program: not specified |
Capillary | 5 % Phenyl methyl siloxane | 398.40 | Skrbic and Onjia, 2006 | Program: 70 0C (2 min) 30 0C/min -> 150 0C 5 0C/min -> 200 0C 4 0C/min -> 310 0C (5 min) |
Capillary | DB-5MS | 397.7 | Aracil, Font, et al., 2005 | Column length: 60. m; Column diameter: 0.25 mm; Program: not specified |
Capillary | LM-5 | 398.31 | Ré-Poppi and Santiago-Silva, 2005 | 30. m/0.25 mm/0.25 μm, He; Program: 60C(2min) => 15C/min => 180C => 5C/min => 280C (10min) |
Capillary | LM-5 | 398.4 | Ré-Poppi and Santiago-Silva, 2005 | 30. m/0.25 mm/0.25 μm, He; Program: 60C(2min) => 15C/min => 180C => 5C/min => 280C (10min) |
Capillary | Ultra-1 | 398.3 | Sremac, Skrbic, et al., 2005 | 50. m/0.32 mm/0.50 μm, Nitrogen; Program: 40-100 0C 3-15 0C/min -> 290 0C |
Capillary | Ultra-1 | 398.4 | Sremac, Skrbic, et al., 2005 | 50. m/0.32 mm/0.50 μm, Nitrogen; Program: 40-100 0C 3-15 0C/min -> 290 0C |
Capillary | Ultra-1 | 398.6 | Sremac, Skrbic, et al., 2005 | 50. m/0.32 mm/0.50 μm, Nitrogen; Program: 40-100 0C 3-15 0C/min -> 290 0C |
Capillary | HP-5 MS | 398.7 | Brack and Schirmer, 2003 | 30. m/0.25 mm/0.25 μm, Helium; Program: 70 0C 7 0C/min -> 280 0C (2 min) 7 0C/min -> 300 0C (2 min) |
Capillary | DB-5 | 398.6 | Lundstedt, Haglund, et al., 2003 | 30. m/0.25 mm/0.25 μm; Program: not specified |
Capillary | LM-5 | 398.36 | Ré-Poppi and Santiago-Silva, 2002 | 30. m/0.25 mm/0.25 μm, He; Program: 60C(2min) => 15C/min => 180C => 5C/min => 280C(5min) |
Capillary | LM-5 | 398.40 | Ré-Poppi and Santiago-Silva, 2002 | 30. m/0.25 mm/0.25 μm, He; Program: 60C(2min) => 15C/min => 180C => 5C/min => 280C(5min) |
Capillary | DB-5 | 398.7 | Zamperlini, Silva, et al., 1997 | 30. m/0.25 mm/0.25 μm, He; Program: 90C (1min) => 10C/min => 120C => 4C/min => 310C (20min) |
Capillary | DB-5 | 400.29 | Zamperlini, Silva, et al., 1997 | 30. m/0.25 mm/0.25 μm, He; Program: 90C (1min) => 10C/min => 120C => 4C/min => 310C (20min) |
Capillary | SE-54 | 398.50 | Chen, 1996 | Column length: 30. m; Column diameter: 0.25 mm; Program: not specified |
Capillary | SE-52 | 398.76 | Shaogang and Xiaobai, 1994 | Column length: 30. m; Column diameter: 0.25 mm; Program: not specified |
Capillary | SE-54 | 396.46 | Guillen, Iglesias, et al., 1992 | Program: not specified |
Capillary | DB-5 | 398.41 | Takada, Onda, et al., 1990 | He; Program: 70C(2min) => 30C/min => 150C => 5C/min => 200C => 4C/min => 310C |
Capillary | DB-5 | 398.50 | Naikwadi, Charbonneau, et al., 1987 | Column length: 30. m; Column diameter: 0.32 mm; Program: not specified |
Capillary | DB-5 | 399.10 | Naikwadi, Charbonneau, et al., 1987 | Column length: 30. m; Column diameter: 0.32 mm; Program: not specified |
Capillary | OV-101 | 400.0 | Tucminen, Wickstrom, et al., 1986 | Program: not specified |
Capillary | DB-5 | 396.38 | Tong, Centen, et al., 1985 | He; Column length: 30. m; Column diameter: 0.25 mm; Program: not specified |
Capillary | SE-52 | 394.44 | Shlyakhov, 1984 | Program: not specified |
Capillary | SE-52 | 396.70 | Shlyakhov, 1984 | Program: not specified |
Capillary | SE-52 | 397.95 | Shlyakhov, 1984 | Program: not specified |
Capillary | SE-52 | 398.46 | Shlyakhov, 1984 | Program: not specified |
Capillary | SE-52 | 398.47 | Shlyakhov, 1984 | Program: not specified |
Capillary | SE-52 | 398.50 | Shlyakhov, 1984 | Program: not specified |
Capillary | SE-52 | 398.59 | Shlyakhov, 1984 | Program: not specified |
Capillary | SE-52 | 400.00 | Shlyakhov, 1984 | Program: not specified |

References

Roux, Temprado, et al., 2008
Roux, M.V.; Temprado, M.; Chickos, J.S.; Nagano, Y.,
Critically Evaluated Thermochemical Properties of Polycyclic Aromatic Hydrocarbons,
J. Phys. Chem. Ref. Data, 2008, 37, 4, 1855-1996. [all data]
Dorofeeva O.V., 1988
Dorofeeva O.V.,
Thermodynamic Properties of Polycyclic Aromatic Hydrocarbons in the Gaseous Phase. Institute for High Temperatures, USSR Academy of Sciences, Preprint No.1-238 (in Russian), Moscow, 1988. [all data]
Dorofeeva O.V., 1986
Dorofeeva O.V.,
On calculation of thermodynamic properties of polycyclic aromatic hydrocarbons,
Thermochim. Acta, 1986, 102, 59-66. [all data]
Moiseeva N.F., 1989
Moiseeva N.F.,
Development of Benson group additivity method for estimation of ideal gas thermodynamic properties of polycyclic aromatic hydrocarbons,
Thermochim. Acta, 1989, 153, 77-85. [all data]
Frenkel M., 1994
Frenkel M.,
Thermodynamics of Organic Compounds in the Gas State, Vol. I, II, Thermodynamics Research Center, College Station, Texas, 1994, 1994. [all data]
Magnus, Hartmann, et al., 1951
Magnus, A.; Hartmann, H.; Becker, F.,
Verbrennungswarmen und resonanzenergien von mehrkernigen aromatischen kohlenwasserstoffen,
Z. Phys. Chem., 1951, 197, 75-91. [all data]
Cox and Pilcher, 1970
Cox, J.D.; Pilcher, G.,
Thermochemistry of Organic and Organometallic Compounds, Academic Press, New York, 1970, 1-636. [all data]
Ueberreiter and Orthmann, 1950
Ueberreiter, K.; Orthmann, H.-J.,
Specifische Wärme, spezifisches Volumen, Temperatur- und Wärme-leittähigkeit einiger disubstituierter Benzole und polycyclischer Systeme,
Z. Natursforsch. 5a, 1950, 101-108. [all data]
Aldrich Chemical Company Inc., 1990
Aldrich Chemical Company Inc.,
Catalog Handbook of Fine Chemicals, Aldrich Chemical Company, Inc., Milwaukee WI, 1990, 1. [all data]
Wakayama and Inokuchi, 1967
Wakayama, N.; Inokuchi, H.,
Heats of Sublimation of Polycyclic Aromatic Hydrocarbons and Their Molecular Packings,
Bull. Chem. Soc. Jpn., 1967, 40, 2267-71. [all data]
Franck, 1955
Franck, H.G.,
The true nature of coal tar pitch,
Brennst.-Chem., 1955, 36, 12. [all data]
Kruber, Raeithel, et al., 1955
Kruber, O.; Raeithel, A.; Grigoleit, G.,
Compounds Proved to Be Present in Coal Tar,
Erdoel Kohle, 1955, 8, 637. [all data]
Kruber and Grigoleit, 1954
Kruber, O.; Grigoleit,
Chem. Ber., 1954, 87, 1895. [all data]
Hanshaw, Nutt, et al., 2008
Hanshaw, William; Nutt, Marjorie; Chickos, James S.,
Hypothetical Thermodynamic Properties. Subcooled Vaporization Enthalpies and Vapor Pressures of Polyaromatic Hydrocarbons,
J. Chem. Eng. Data, 2008, 53, 8, 1903-1913, https://doi.org/10.1021/je800300x
. [all data]
Haftka, Parsons, et al., 2006
Haftka, Joris J.H.; Parsons, John R.; Govers, Harrie A.J.,
Supercooled liquid vapour pressures and related thermodynamic properties of polycyclic aromatic hydrocarbons determined by gas chromatography,
Journal of Chromatography A, 2006, 1135, 1, 91-100, https://doi.org/10.1016/j.chroma.2006.09.050
. [all data]
Kruif, 1980
Kruif, C.G.,
Enthalpies of sublimation and vapour pressures of 11 polycyclic hydrocarbons,
J. Chem. Thermodyn., 1980, 12, 243-248. [all data]
Wakayama and Inokuchi, 1967, 2
Wakayama, N.; Inokuchi, H.,
Heats of sublimation of polycyclic aromatic hydrocarbons and their molecular packings,
Bull. Chem. Soc. Jpn., 1967, 40, 2267. [all data]
Hinckley, Bidleman, et al., 1990
Hinckley, Daniel A.; Bidleman, Terry F.; Foreman, William T.; Tuschall, Jack R.,
Determination of vapor pressures for nonpolar and semipolar organic compounds from gas chromatograhic retention data,
J. Chem. Eng. Data, 1990, 35, 3, 232-237, https://doi.org/10.1021/je00061a003
. [all data]
Nass, Lenoir, et al., 1995
Nass, Karen; Lenoir, Dieter; Kettrup, Antonius,
Calculation of the Thermodynamic Properties of Polycyclic Aromatic Hydrocarbons by an Incremental Procedure,
Angew. Chem. Int. Ed. Engl., 1995, 34, 16, 1735-1736, https://doi.org/10.1002/anie.199517351
. [all data]
Stephenson and Malanowski, 1987
Stephenson, Richard M.; Malanowski, Stanislaw,
Handbook of the Thermodynamics of Organic Compounds, 1987, https://doi.org/10.1007/978-94-009-3173-2
. [all data]
Murray, Pottie, et al., 1974
Murray, John James; Pottie, Roswell Francis; Pupp, Christian,
The Vapor Pressures and Enthalpies of Sublimation of Five Polycyclic Aromatic Hydrocarbons,
Can. J. Chem., 1974, 52, 4, 557-563, https://doi.org/10.1139/v74-087
. [all data]
Ferro, Imperatori, et al., 1983
Ferro, Daniela; Imperatori, Patrizia; Quagliata, Claudio,
Study of the stability of the phenanthrene- and 1,2-benzanthracene-choleic acids by vapor pressure measurements,
J. Chem. Eng. Data, 1983, 28, 2, 242-244, https://doi.org/10.1021/je00032a031
. [all data]
Wakayama and Inokuchi, 1967, 3
Wakayama, Nobuko; Inokuchi, Hiroo,
Heats of Sublimation of Polycyclic Aromatic Hydrocarbons and Their Molecular Packings,
Bull. Chem. Soc. Jpn., 1967, 40, 10, 2267-2271, https://doi.org/10.1246/bcsj.40.2267
. [all data]
Kelley and Rice, 1964
Kelley, J.D.; Rice, F.O.,
The vapor pressures of some polynuclear aromatic hydrocarbons,
J. Phys. Chem., 1964, 68, 3794. [all data]
Kelley and Rice, 1964, 2
Kelley, J. Daniel; Rice, Francis Owen,
The Vapor Pressures of Some Polynuclear Aromatic Hydrocarbons 1,
J. Phys. Chem., 1964, 68, 12, 3794-3796, https://doi.org/10.1021/j100794a043
. [all data]
Hoyer and Peperle, 1958
Hoyer, H.; Peperle, W.,
Z. Elektrochem., 1958, 62, 61. [all data]
Hoyer and Peperle, 1958, 2
Hoyer, H.; Peperle, W.,
Dampfdrunkmessungen an organischen substanzen und ihre sublimationswarmen,
Z. Electrochem., 1958, 62, 61-66. [all data]
Kestens, Auclair, et al., 2010
Kestens, Vikram; Auclair, Guy; Drozdzewska, Katarzyna; Held, Andrea; Roebben, Gert; Linsinger, Thomas,
Thermodynamic property values of selected polycyclic aromatic hydrocarbons measured by differential scanning calorimetry,
J Therm Anal Calorim, 2010, 99, 1, 245-261, https://doi.org/10.1007/s10973-009-0440-6
. [all data]
Acree, 1991
Acree, William E.,
Thermodynamic properties of organic compounds: enthalpy of fusion and melting point temperature compilation,
Thermochimica Acta, 1991, 189, 1, 37-56, https://doi.org/10.1016/0040-6031(91)87098-H
. [all data]
Chen and Cooks, 1995
Chen, G.D.; Cooks, R.G.,
Electron affinities of polycyclic aromatic hydrocarbons determined by the kinetic method,
J. Mass Spectrom., 1995, 30, 8, 1167, https://doi.org/10.1002/jms.1190300814
. [all data]
Becker and Chen, 1966
Becker, R.S.; Chen, E.,
Extension of Electron Affinities and Ionization Potentials of Aromatic Hydrocarbons,
J. Chem. Phys., 1966, 45, 7, 2403, https://doi.org/10.1063/1.1727954
. [all data]
Wentworth and Becker, 1962
Wentworth, W.E.; Becker, R.S.,
Potential Method for the Determination of Electron Affinities of Molecules: Application to Some Aromatic Hydrocarbons.,
J. Am. Chem. Soc., 1962, 84, 22, 4263, https://doi.org/10.1021/ja00881a014
. [all data]
Wacks, 1964
Wacks, M.E.,
Electron-impact studies of aromatic hydrocarbons. II. Naphthacene, naphthaphene, chrysene, triphenylene, and pyrene,
J. Chem. Phys., 1964, 41, 1661. [all data]
Kuroda, 1964
Kuroda, H.,
Ionization potentials of polycyclic aromatic hydrocarbons,
Nature, 1964, 201, 1214. [all data]
Briegleb, 1964
Briegleb, G.,
Electron affinity of organic molecules,
Angew. Chem. Intern. Ed., 1964, 3, 617. [all data]
Kinoshita, 1962
Kinoshita, M.,
The absorption spectra of the molecular complexes of aromatic compounds with p-bromanil,
Bull. Chem. Soc. Japan, 1962, 35, 1609. [all data]
Briegleb, Czekalla, et al., 1961
Briegleb, G.; Czekalla, J.; Reuss, G.,
Mesomeriemomente und Elektronenuberfuhrungsbanden von Elektronen-donator-akzeptor-komplexen des Chloranils und Tetracyanathylens mit aromatischen Kohlenwasserstoffen,
Z. Phys. Chem. (Neue Folge), 1961, 30, 333. [all data]
Birks and Stifkin, 1961
Birks, J.B.; Stifkin, M.A.,
π-Electronic excitation and ionization energies of condensed ring aromatic hydrocarbons,
Nature, 1961, 191, 761. [all data]
Briegleb and Czekalla, 1959
Briegleb, G.; Czekalla, J.,
Die Bestimmung von lonisierungsenergien aus den Spektren von Elektronenubergangskomplexen,
Z.Elektrochem., 1959, 63, 6. [all data]
Matsen, 1956
Matsen, F.A.,
Electron affinities, methyl affinities, and ionization energies of condensed ring aromatic hydrocarbons,
J. Chem. Phys., 1956, 24, 602. [all data]
Akiyama, Harvey, et al., 1981
Akiyama, I.; Harvey, R.G.; LeBreton, P.R.,
Ultraviolet photoelectron studies of methyl-substituted benz[a]anthracenes,
J. Am. Chem. Soc., 1981, 103, 6330. [all data]
Schmidt, 1977
Schmidt, W.,
Photoelectron spectra of polynuclear aromatics. V. Correlations with ultraviolet absorption spectra in the catacondensed series,
J. Chem. Phys., 1977, 66, 828. [all data]
Clar and Schmidt, 1976
Clar, E.; Schmidt, W.,
Correlations between photoelectron and phosphorescence spectra of polycyclic hydrocarbons,
Tetrahedron, 1976, 32, 2563. [all data]
Dewar and Goodman, 1972
Dewar, M.J.S.; Goodman, D.W.,
Photoelectron spectra of molecules. Part 5.--Polycyclic aromatic hydrocarbons,
J. Chem. Soc. Faraday Trans. 2, 1972, 68, 1784. [all data]
Brogli and Heilbronner, 1972
Brogli, F.; Heilbronner, E.,
The photoelectron spectra of benzenoid hydrocarbons C18H12,
Angew. Chem. Int. Ed. Engl., 1972, 11, 538. [all data]
Boschi, Murrell, et al., 1972
Boschi, R.; Murrell, J.N.; Schmidt, W.,
Photoelectron spectra of polycyclic aromatic hydrocarbons,
Faraday Discuss. Chem. Soc., 1972, 54, 116. [all data]
Richmond and Pombo-Villar, 1997
Richmond, R.; Pombo-Villar, E.,
Short communication. Gas chromatography-mass spectrometry coupled with pseudo-Sadtler retention indices, for the identification of components in the essential oil of Curcuma longa L.,
J. Chromatogr. A, 1997, 760, 2, 303-308, https://doi.org/10.1016/S0021-9673(96)00802-3
. [all data]
Gautzsch and Zinn, 1996
Gautzsch, R.; Zinn, P.,
Use of incremental models to estimate the retention indexes of aromatic compounds,
Chromatographia, 1996, 43, 3/4, 163-176, https://doi.org/10.1007/BF02292946
. [all data]
Beernaert, 1979
Beernaert, H.,
Gas Chromatographic Analysis of Polyclylic Aromatic Hydrocarbons,
J. Chromatogr., 1979, 173, 1, 109-118, https://doi.org/10.1016/S0021-9673(01)80450-7
. [all data]
Carugno and Rossi, 1967
Carugno, N.; Rossi, S.,
Evaluation of polynuclear hydrocarbons in cigarette smoke by glass capillary columns,
J. Gas Chromatogr., 1967, 5, 2, 103-106, https://doi.org/10.1093/chromsci/5.2.103
. [all data]
Yasuhara, Shiraishi, et al., 1997
Yasuhara, A.; Shiraishi, H.; Nishikawa, M.; Yamamoto, T.; Uehiro, T.; Nakasugi, O.; Okumura, T.; Kenmotsu, K.; Fukui, H.; Nagase, M.; Ono, Y.; Kawagoshi, Y.; Baba, K.; Noma, Y.,
Determination of organic components in leachates from hazardous waste disposal sites in Japan by gas chromatography-mass spectrometry,
J. Chromatogr. A, 1997, 774, 1-2, 321-332, https://doi.org/10.1016/S0021-9673(97)00078-2
. [all data]
Oda, Ichikawa, et al., 1996
Oda, J.; Ichikawa, S.; Mori, T.,
Analysis of polycyclic aromatic hydrocarbons in airborne particulates by capillary GC/MS method with programmed temperature relative retention index,
Bunseki Kagaku, 1996, 45, 9, 825-835, https://doi.org/10.2116/bunsekikagaku.45.825
. [all data]
Miao and Wu, 1999
Miao, X.; Wu, F.,
Study on retention behaviors of polycyclic aromatic hydrocarbons by gas chromatography in different operation models,
J. Instrumental Anal., 1999, 15, 4, 288-292. [all data]
Elizalde-González, Hutfliess, et al., 1996
Elizalde-González, M.P.; Hutfliess, M.; Hedden, K.,
Retention index system, adsorption characteristics, and sructure correlations of polycyclic aromatic hydrocarbons in fuels,
J. Hi. Res. Chromatogr., 1996, 19, 6, 345-352, https://doi.org/10.1002/jhrc.1240190608
. [all data]
Quilliam, Lant, et al., 1985
Quilliam, M.A.; Lant, M.S.; Kaiser-Farrell, C.; McCalla, D.R.; Sheldrake, C.P.; Kerr, A.A.; Lockington, J.N.; Gibson, E.S.,
Identification of polycyclic aromatic compounds in of poly-mutagenic emissions from steel casting,
Biomed. Mass Spectrom., 1985, 12, 4, 143-150, https://doi.org/10.1002/bms.1200120402
. [all data]
Oda, Yasuhara, et al., 1998
Oda, J.; Yasuhara, A.; Matsunaga, K.; Saito, Y.,
Identification of polycyclic aromatic hydrocarbons of the particulate accumulated in the tunnel duct of freeway and generation of their oxygenated derivatives,
Jpn. J. Toxicol. Environ. Health, 1998, 44, 5, 334-351, https://doi.org/10.1248/jhs1956.44.334
. [all data]
Shlyakhov, 1984
Shlyakhov, A.F.,
Gas chromatography in organic geochemistry, Nedra, Moscow, 1984, 221. [all data]
Jamoussi, Kanzari, et al., 2007
Jamoussi, B.; Kanzari, F.; Hassine, B.B.; Abderrabba, A.,
Using Bezier curves for the calculation of retention indices of polycyclic aromatic hydrocarbons in the so-called Lee's scale in temperature-programmed gas chromatography with mass spectrometry detection,
J. Chromatogr. Sci., 2007, 45, 1, 22-27, https://doi.org/10.1093/chromsci/45.1.22
. [all data]
Skrbic and Onjia, 2006
Skrbic, B.; Onjia, A.,
Prediction of Lee Retention Indices of Polycyclic Aromatic Hydrocarbons by Artificial Neural Networks,
J. Chromatorg. A, 2006, 1108, 2, 279-284, https://doi.org/10.1016/j.chroma.2006.01.080
. [all data]
Pedersen, Durant, et al., 2005
Pedersen, D.U.; Durant, J.L.; Taghizadeh, K.; Hemond, H.F.; Lafleur, A.L.; Cass, G.R.,
Human cell mutagenes in respirable airborne particles from the Northeastern United States. 2. Quantification of mutagenes and other organic compounds.,
Environ. Sci. Technol., 2005, 39, 24, 9547-9560, https://doi.org/10.1021/es050886c
. [all data]
Marynowski, Pieta, et al., 2004
Marynowski, L.; Pieta, M.; Janeczek, J.,
Composition and source of polycyclic aromatic compounds in deposited dust from selected sites around the Upper Silesia, Poland,
Geol. Q., 2004, 48, 2, 169-180. [all data]
Chen, Keeran, et al., 2002
Chen, P.H.; Keeran, W.S.; Van Ausdale, W.A.; Schindler, D.R.; Roberts, D.W.,
Application of Lee retention indices to the confirmation of tentatively identified compounds from GC/MS analysis of environmental samples, Technical paper, Analytical Services Division, Environmental ScienceEngineering, Inc, PO Box 1703, Gainesville, FL 32602, 2002, 11. [all data]
Wang, Jia, et al., 2000
Wang, J.; Jia, C.R.; Wong, C.K.; Wong, P.K.,
Characterization of polycyclic aromatic hydrocarbons created in lubricating oils,
Water Air Soil Poll., 2000, 120, 3/4, 381-396, https://doi.org/10.1023/A:1005251618062
. [all data]
Piao, Chu, et al., 1999
Piao, M.; Chu, S.; Zheng, M.; Xu, X.,
Characterization of the combustion products of polyethylene,
Chemosphere, 1999, 39, 9, 1497-1512, https://doi.org/10.1016/S0045-6535(99)00054-5
. [all data]
Chen, 1996
Chen, J.,
GC and GC/MS methods for the analysis of polycyclic aromatic hydrocarbon (PAH) in sediment of the grand canal of China,
Toxicol. Environ. Chem., 1996, 54, 1-4, 69-73, https://doi.org/10.1080/02772249609358297
. [all data]
Shaogang and Xiaobai, 1994
Shaogang, C.; Xiaobai, X.,
System for calculating the linear temperature-programmed retention indices of polycylic aromatic compounds,
J. Hi. Res. Chromatogr., 1994, 17, 5, 339-342, https://doi.org/10.1002/jhrc.1240170511
. [all data]
Donnelly, Abdel-Hamid, et al., 1993
Donnelly, J.R.; Abdel-Hamid, M.S.; Jeter, J.L.; Gurka, D.F.,
Application of gas chromatographic retention properties to the identification of environmental contaminants,
J. Chromatogr., 1993, 642, 1-2, 409-415, https://doi.org/10.1016/0021-9673(93)80106-I
. [all data]
Knobloch and Engewald, 1993
Knobloch, T.; Engewald, W.,
Identification of some polar polycyclic compounds in emissions from brown-coal-fired residential stoves,
J. Hi. Res. Chromatogr., 1993, 16, 4, 239-242, https://doi.org/10.1002/jhrc.1240160407
. [all data]
Guillén, Blanco, et al., 1989
Guillén, M.D.; Blanco, J.; Bermejo, J.; Blanco, C.G.,
Temperature programmed retention indices of some PAHs on Capillary columns coated with OV-1701 and SE-54,
J. Hi. Res. Chromatogr., 1989, 12, 8, 552-554, https://doi.org/10.1002/jhrc.1240120816
. [all data]
Hasegawa, Muragishi, et al., 1988
Hasegawa, K.; Muragishi, T.; Usami, S.,
Component analysis of coal-derivated heavy oil. Analysis of carcinogenic components in neutral nonpolar fractions,
Nippon Kagaku Kaishi, 1988, 3, 3, 311-320, https://doi.org/10.1246/nikkashi.1988.311
. [all data]
Sye, Lin, et al., 1988
Sye, W.-F.; Lin, C.-L.; Yen, D.-P.; Tsai, C.-S.,
Polycyclic aromatic-hydrocarbons formation from luel and additives combustion,
J. Chinese Chem. Soc., 1988, 35, 1, 1-11. [all data]
Wise, Benner, et al., 1988
Wise, S.A.; Benner, B.A.; Byrd, G.D.; Chesler, S.N.; Rebbert, R.E.; Schantz, M.M.,
Determination of polycyclic aromatic hydrocarbons in a coal tar standard reference material,
Anal. Chem., 1988, 60, 9, 887-894, https://doi.org/10.1021/ac00160a012
. [all data]
Boenke and Ballschmiter, 1987
Boenke, A.; Ballschmiter, K.,
Fused quinones as retention index marker in high resolution gas chromatography with electron-capture detection (HRGC/ECD) of oxidized aromatic compounds,
Fresenius J. Anal. Chem., 1987, 327, 1, 44-45, https://doi.org/10.1007/BF00474554
. [all data]
Rostad and Pereira, 1986
Rostad, C.E.; Pereira, W.E.,
Kovats and Lee retention indices determined by gas chromatography/mass spectrometry for organic compounds of environmental interest,
J. Hi. Res. Chromatogr. Chromatogr. Comm., 1986, 9, 6, 328-334, https://doi.org/10.1002/jhrc.1240090603
. [all data]
Tong, Centen, et al., 1985
Tong, H.Y.; Centen, J.D.; Karasek, F.W.; Jellum, E.; Helland, P.,
Identification of Trace Organic Compounds in Dimethyl Sulphoxide Solution Using High-Performance Liquid Chromatography and Gas Chromatography-Mass Spectrometry,
J. Chromatogr., 1985, 324, 373-383, https://doi.org/10.1016/S0021-9673(01)81336-4
. [all data]
Vassilaros, Kong, et al., 1982
Vassilaros, D.L.; Kong, R.C.; Later, D.W.; Lee, M.L.,
Linear retention index system for polycyclic aromatic compounds. Critical evaluation and additional indices,
J. Chromatogr., 1982, 252, 1-20, https://doi.org/10.1016/S0021-9673(01)88394-1
. [all data]
Lee, Vassilaros, et al., 1979
Lee, M.L.; Vassilaros, D.L.; White, C.M.; Novotny, M.,
Retention Indices for Programmed-Temperature Capillary-Column Gas Chromatography of Polycyclic Aromatic Hydrocarbons,
Anal. Chem., 1979, 51, 6, 768-773, https://doi.org/10.1021/ac50042a043
. [all data]
Fuentes, Font, et al., 2007
Fuentes, M.J.; Font, R.; Gomez-Rico, M.F.; Martin-Gullon, I.,
Pyrolysis and combustion of waste lubricant oil from diesel cars: Decomposition and pollutants,
J. Anal. Appl. Pyrolysis, 2007, 79, 1-2, 215-226, https://doi.org/10.1016/j.jaap.2006.12.004
. [all data]
Wang, Li, et al., 2007
Wang, Z.; Li, K.; Lambert, P.; Yang, C.,
Identification, characterization and quantitation of pyrogenic polycylic aromatic hydrocarbons and other organic compounds in tire fire products,
J. Chromatogr. A, 2007, 1139, 1, 14-26, https://doi.org/10.1016/j.chroma.2006.10.085
. [all data]
Wang, Li, et al., 2007, 2
Wang, Z.; Li, K.; Lambert, P.; Brown, C.E.; Yang, C.; Hollebone, B.P.,
Identification and characterization of polycyclic aromatic compounds in tire fire products and differentiation of pyrogenic PAHs from petrogenic PAHs
in Proceedings of the 30th Arctic and Marine Oilspill (AMOP) Technical Seminar. Vol.1, 2007, 61-85. [all data]
Aracil, Font, et al., 2005
Aracil, I.; Font, R.; Conesa, J.A.,
Semivolatile and volatile compounds from the pyrolysis and combustion of polyvinyl chloride,
J. Anal. Appl. Pyrolysis, 2005, 74, 1-2, 465-478, https://doi.org/10.1016/j.jaap.2004.09.008
. [all data]
Ré-Poppi and Santiago-Silva, 2005
Ré-Poppi, N.; Santiago-Silva, M.,
Polycyclic aromatic hydrocarbons and other selected organic compounds in ambient air of Campo Grande City, Brazil,
Atmos. Environ., 2005, 39, 16, 2839-2850, https://doi.org/10.1016/j.atmosenv.2004.10.006
. [all data]
Sremac, Skrbic, et al., 2005
Sremac, S.; Skrbic, B.; Onjia, A.,
Artificial neural network prediction of quantitative structure-retention relationships of polycyclic aromatic hydrocarbons in gas chromatography,
J. Serb. Chem. Soc., 2005, 70, 11, 1291-1300, https://doi.org/10.2298/JSC0511291S
. [all data]
Brack and Schirmer, 2003
Brack, W.; Schirmer, K.,
Effect-directed identification of oxygen and sulfur heterocycles as major polycyclic aromatic cytochrome P4501A-inducers in a contaminated sedimet,
Environ. Sci. Technol., 2003, 37, 14, 3062-3070, https://doi.org/10.1021/es020248j
. [all data]
Lundstedt, Haglund, et al., 2003
Lundstedt, S.; Haglund, P.; Öberg, L.,
Degradation and formation of polycyclic aromatic compounds during bioslurry treatment of an aged gasworks soil,
Environ. Toxicol. Chem., 2003, 22, 7, 1413-1420, https://doi.org/10.1002/etc.5620220701
. [all data]
Ré-Poppi and Santiago-Silva, 2002
Ré-Poppi, N.; Santiago-Silva, M.R.,
Identification of polycyclic aromatic hydrocarbons and methoxylated phenols in wood smoke emitted during production of charcoal,
Chromatographia, 2002, 55, 7/8, 475-481, https://doi.org/10.1007/BF02492280
. [all data]
Zamperlini, Silva, et al., 1997
Zamperlini, G.C.M.; Silva, M.R.S.; Vilegas, W.,
Identification of polycyclic aromatic hydrocarbons in sugar cane soot by gas chromatography-mass spectrometry,
Chromatographia, 1997, 46, 11/12, 655-663, https://doi.org/10.1007/BF02490527
. [all data]
Guillen, Iglesias, et al., 1992
Guillen, M.D.; Iglesias, M.J.; Dominguez, A.; Blanco, C.G.,
Polynuclear aromatic hydrocarbon retention indices on SE-54 stationary phase of the volatile components of a coal tar pitch. Relationships between chromatographic retention and thermal reactivity,
J. Chromatogr., 1992, 591, 1-2, 287-295, https://doi.org/10.1016/0021-9673(92)80246-Q
. [all data]
Takada, Onda, et al., 1990
Takada, H.; Onda, T.; Ogura, N.,
Determination of polycyclic aromatic hydrocarbons in urban street dusts and their source materials by capillary gas chromatography,
Environ. Sci. Technol., 1990, 24, 8, 1179-1186, https://doi.org/10.1021/es00078a005
. [all data]
Naikwadi, Charbonneau, et al., 1987
Naikwadi, K.P.; Charbonneau, G.M.; Karasek, F.W.; Clement, R.E.,
Separation and Identification of Organic Compounds in Air Particulate Extracts by High-Performance Liquid Chromatography and Gas Chromatography-Mass Spectrometry,
J. Chromatogr., 1987, 398, 227-237, https://doi.org/10.1016/S0021-9673(01)96508-2
. [all data]
Tucminen, Wickstrom, et al., 1986
Tucminen, A.; Wickstrom, K.; Pyysalo, H.,
Determination of Polycyclic Aromatic Compounds by GLC-Selected Ion Monitoring (SIM) Technique,
J. Hi. Res. Chromatogr. Chromatogr. Comm., 1986, 9, 8, 469-471, https://doi.org/10.1002/jhrc.1240090813
. [all data]