Ethylene, 1,1-bis(trimethylsilyl)-
- Formula: C8H20Si2
- Molecular weight: 172.4154
- IUPAC Standard InChIKey: CVCQWLSMIOKNLE-UHFFFAOYSA-N
- CAS Registry Number: 5654-07-9
- Chemical structure:
View 3d structure (requires JavaScript / HTML 5) - Other names: Silane, ethenylidenebis(trimethyl-; 2,4-Disilapentane, 2,2,4,4-tetramethyl-3-methylene-; 1,1-Bis(trimethylsilyl)ethylene

Gas phase ion energetics data

Data compiled by: Henry M. Rosenstock, Keith Draxl, Bruce W. Steiner, and John T. Herron
Appearance energy determinations
Ion | AE (eV) | Other Products | Method | Reference | Comment |
---|---|---|---|---|---|
C8H20Si2+ | 9.25 ± 0.04 | ? | EI | Bock and Seidl, 1968 |

References

Bock and Seidl, 1968
Bock, H.; Seidl, H.,
d-Orbitaleffekte in siliziumsubstituierten π-Elektronensystemen. VI. Spektroskopische Untersuchungen an Alkyl- und Silylathylenen,
J. Organometal. Chem., 1968, 13, 87. [all data]