2,4-Azetidinedione,3-ethyl-1-methyl-3-phenyl-
- Formula: C12H13NO2
- Molecular weight: 203.2371
- IUPAC Standard InChIKey: RYAQGPZYHVOJSF-UHFFFAOYSA-N
- CAS Registry Number: 56519-51-8
- Chemical structure:
View 3d structure (requires JavaScript / HTML 5) - Permanent link for this species. Use this link for bookmarking this species for future reference.

Gas phase ion energetics data

Data compiled by: Sharon G. Lias, Rhoda D. Levin, and Sherif A. Kafafi
Ionization energy determinations
IE (eV) | Method | Reference |
---|---|---|
8.82 | EI | Compernolle and DeSchryver, 1975 |
Appearance energy determinations
Ion | AE (eV) | Other Products | Method | Reference | Comment |
---|---|---|---|---|---|
C10H10O+ | 8.83 | CH3NCO | EI | Compernolle and DeSchryver, 1975 |

References

Compernolle and DeSchryver, 1975
Compernolle, F.; DeSchryver, F.,
Nonconcerted cycloreversion by electron impact of substituted 2,4-azetidinediones. Relations between the mass spectral and photochemical reactions,
J. Am. Chem. Soc., 1975, 97, 3909. [all data]