Ethane, 1-(ethylthio)-2-methoxy-
- Formula: C5H12OS
- Molecular weight: 120.213
- IUPAC Standard InChIKey: QFUHDBWWTVDPBX-UHFFFAOYSA-N
- CAS Registry Number: 56444-81-6
- Chemical structure:
View 3d structure (requires JavaScript / HTML 5) - Permanent link for this species. Use this link for bookmarking this species for future reference.

Gas phase ion energetics data

Data compiled by: Sharon G. Lias, Rhoda D. Levin, and Sherif A. Kafafi
Ionization energy determinations
IE (eV) | Method | Reference |
---|---|---|
8.33 ± 0.02 | PI | Trofimov, Mel'der, et al., 1975 |

References

Trofimov, Mel'der, et al., 1975
Trofimov, B.A.; Mel'der, U.K.; Pikver, R.I.; Vyalykh, E.P.,
Ionization potentials of unsaturated and sulfides the participation of neighboring multiple bonds of heteroatoms in the stabilization of the radical cation,
Teor. Eksp. Khim., 1975, 11, 129. [all data]