Alanine
- Formula: C3H7NO2
- Molecular weight: 89.0932
- IUPAC Standard InChIKey: QNAYBMKLOCPYGJ-UWTATZPHSA-N
- CAS Registry Number: 56-41-7
- Chemical structure:
View 3d structure (requires JavaScript / HTML 5) - Stereoisomers:
- Other names: L-Alanine; Alanine, L-; α-Alanine; α-Aminopropionic acid; (S)-Alanine; L-α-Alanine; L-α-Aminopropionic acid; L-(+)-Alanine; L-2-Aminopropanoic acid; L-2-Aminopropionic acid; Propanoic acid, 2-amino-; Propanoic acid, 2-amino-, (S)-; L-CH3CH(NH2)COOH; (S)-2-Aminopropanoic acid; 2-Aminopropanoic acid; 2-Aminopropionic acid; Ala; Ritalanine; NSC 206315; 2-Aminopropanoic acid, L-

Gas phase thermochemistry data

Data compiled by: Hussein Y. Afeefy, Joel F. Liebman, and Stephen E. Stein
Quantity | Value | Units | Method | Reference | Comment |
---|---|---|---|---|---|
ΔfH°gas | -414.7 ± 4.2 | kJ/mol | Ccr | Ngauv, Sabbah, et al., 1977 |

Condensed phase thermochemistry data

Data compiled as indicated in comments:
ALS - Hussein Y. Afeefy, Joel F. Liebman, and Stephen E. Stein
DH - Eugene S. Domalski and Elizabeth D. Hearing
Quantity | Value | Units | Method | Reference | Comment |
---|---|---|---|---|---|
ΔfH°solid | -560. ± 1.7 | kJ/mol | Ccb | Contineanu and Marchidan, 1984 | ALS |
ΔfH°solid | -559.48 | kJ/mol | Ccr | Ngauv, Sabbah, et al., 1977 | ALS |
ΔfH°solid | -562.7 | kJ/mol | Ccb | Hutchens, Cole, et al., 1963 | Heat of combustion is not reported; ALS |
Quantity | Value | Units | Method | Reference | Comment |
ΔcH°solid | -1621. ± 1.7 | kJ/mol | Ccb | Contineanu and Marchidan, 1984 | ALS |
ΔcH°solid | -1621.45 ± 0.48 | kJ/mol | Ccr | Ngauv, Sabbah, et al., 1977 | ALS |
ΔcH°solid | -1577. ± 2. | kJ/mol | Ccb | Tsuzuki, Harper, et al., 1958 | ALS |
ΔcH°solid | -1634.1 | kJ/mol | Ccb | Lemoult, 1904 | ALS |
Quantity | Value | Units | Method | Reference | Comment |
S°solid,1 bar | 129.21 | J/mol*K | N/A | Hutchens, Cole, et al., 1960 | DH |
S°solid,1 bar | 118.8 | J/mol*K | N/A | Daurel, Delhaes, et al., 1975 | DH |
Constant pressure heat capacity of solid
Cp,solid (J/mol*K) | Temperature (K) | Reference | Comment |
---|---|---|---|
115. | 298. | Badelin, Kulikov, et al., 1990 | T = 298, 313, 333, 348 K.; DH |
115.2 | 298. | Kulikov, Kozlov, et al., 1989 | T = 298 to 348 K.; DH |
122.26 | 298.15 | Hutchens, Cole, et al., 1960 | T = 11 to 305 K.; DH |

Gas phase ion energetics data

Data evaluated as indicated in comments:
HL - Edward P. Hunter and Sharon G. Lias
L - Sharon G. Lias
Data compiled as indicated in comments:
B - John E. Bartmess
MM - Michael M. Meot-Ner (Mautner)
LLK - Sharon G. Lias, Rhoda D. Levin, and Sherif A. Kafafi
RDSH - Henry M. Rosenstock, Keith Draxl, Bruce W. Steiner, and John T. Herron
Quantity | Value | Units | Method | Reference | Comment |
---|---|---|---|---|---|
IE (evaluated) | 8.88 | eV | N/A | N/A | L |
Quantity | Value | Units | Method | Reference | Comment |
Proton affinity (review) | 901.6 | kJ/mol | N/A | Hunter and Lias, 1998 | HL |
Quantity | Value | Units | Method | Reference | Comment |
Gas basicity | 867.7 | kJ/mol | N/A | Hunter and Lias, 1998 | HL |
Proton affinity at 298K
Proton affinity (kJ/mol) | Reference | Comment |
---|---|---|
894.5 ± 0.4 | Bouchoux and Salpin, 2003 | T = 298K; MM |
902. ± 4. | Hahn and Wesdemiotis, 2003 | MM |
Gas basicity at 298K
Gas basicity (review) (kJ/mol) | Reference | Comment |
---|---|---|
865.4 ± 0.4 | Bouchoux and Salpin, 2003 | T = 298K; MM |
864.0 ± 6.3 | Cassady, Carr, et al., 1995 | T = 298K; GB> dimethylformamide, ≈ 3-methylaniline, < 3-fluropyridine; MM |
863.6 ± 6.7 | Wu and Lebrilla, 1995 | T = 300K; MM |
Ionization energy determinations
IE (eV) | Method | Reference | Comment |
---|---|---|---|
8.88 | PE | Klasinc, 1976 | LLK |
8.8 | PE | Debies and Rabalais, 1974 | LLK |
9.63 | CTS | Slifkin and Allison, 1967 | RDSH |
De-protonation reactions
C3H6NO2- + =
By formula: C3H6NO2- + H+ = C3H7NO2
Quantity | Value | Units | Method | Reference | Comment |
---|---|---|---|---|---|
ΔrH° | 1430. ± 7.9 | kJ/mol | CIDC | Jones, Bernier, et al., 2007 | gas phase; B |
ΔrH° | 1425. ± 8.8 | kJ/mol | G+TS | Locke and McIver, 1983 | gas phase; B |
Quantity | Value | Units | Method | Reference | Comment |
ΔrG° | 1401. ± 8.4 | kJ/mol | H-TS | Jones, Bernier, et al., 2007 | gas phase; B |
ΔrG° | 1396. ± 8.4 | kJ/mol | IMRE | Locke and McIver, 1983 | gas phase; B |

Reaction thermochemistry data

Data compiled as indicated in comments:
B - John E. Bartmess
RCD - Robert C. Dunbar
Individual Reactions
C3H6NO2- + =
By formula: C3H6NO2- + H+ = C3H7NO2
Quantity | Value | Units | Method | Reference | Comment |
---|---|---|---|---|---|
ΔrH° | 1430. ± 7.9 | kJ/mol | CIDC | Jones, Bernier, et al., 2007 | gas phase; B |
ΔrH° | 1425. ± 8.8 | kJ/mol | G+TS | Locke and McIver, 1983 | gas phase; B |
Quantity | Value | Units | Method | Reference | Comment |
ΔrG° | 1401. ± 8.4 | kJ/mol | H-TS | Jones, Bernier, et al., 2007 | gas phase; B |
ΔrG° | 1396. ± 8.4 | kJ/mol | IMRE | Locke and McIver, 1983 | gas phase; B |
By formula: Na+ + C3H7NO2 = (Na+ • C3H7NO2)
Quantity | Value | Units | Method | Reference | Comment |
---|---|---|---|---|---|
ΔrH° | 169. ± 13. | kJ/mol | IMRE | Gapeev and Dunbar, 2003 | Anchor glycine=38.5+-2.0; RCD |
ΔrH° | 167. | kJ/mol | CIDC | Kish, Ohanessian, et al., 2003 | Anchor alanine=39.89; RCD |

Ion clustering data

Data compiled by: Robert C. Dunbar
Clustering reactions
By formula: Na+ + C3H7NO2 = (Na+ • C3H7NO2)
Quantity | Value | Units | Method | Reference | Comment |
---|---|---|---|---|---|
ΔrH° | 169. ± 13. | kJ/mol | IMRE | Gapeev and Dunbar, 2003 | Anchor glycine=38.5+-2.0 |
ΔrH° | 167. | kJ/mol | CIDC | Kish, Ohanessian, et al., 2003 | Anchor alanine=39.89 |

Phase change data

Data compiled as indicated in comments:
ALS - Hussein Y. Afeefy, Joel F. Liebman, and Stephen E. Stein
AC - William E. Acree, Jr., James S. Chickos
Quantity | Value | Units | Method | Reference | Comment |
---|---|---|---|---|---|
ΔsubH° | 34.6 ± 1.0 | kcal/mol | C | Ngauv, Sabbah, et al., 1977 | ALS |
ΔsubH° | 34.6 ± 1.0 | kcal/mol | N/A | Nguon Ngauv, Sabbah, et al., 1977 | AC |
Enthalpy of sublimation
ΔsubH (kcal/mol) | Temperature (K) | Method | Reference | Comment |
---|---|---|---|---|
31.7 ± 0.2 | 414. | TE,ME | de Kruif, Voogd, et al., 1979 | AC |
31.64 ± 0.31 | 433. | C | Nguon Ngauv, Sabbah, et al., 1977 | Based on data from 413. to 450. K.; AC |
33.0 ± 0.2 | 455. | V | Svec and Clyde, 1965 | ALS |

References

Ngauv, Sabbah, et al., 1977
Ngauv, S.N.; Sabbah, R.; Laffitte, M.,
Thermodynamique de composes azotes. III. Etude thermochimique de la glycine et de la l-α-alanine,
Thermochim. Acta, 1977, 20, 371-380. [all data]
Contineanu and Marchidan, 1984
Contineanu, I.; Marchidan, D.I.,
The enthalpies of combustion and formation of D-alanine, L-alanine, DL-alanine, and β-alanine,
Rev. Roum. Chim., 1984, 29, 43-48. [all data]
Hutchens, Cole, et al., 1963
Hutchens, J.O.; Cole, A.G.; Stout, J.W.,
Heat capacities from 11 to 305°K., entropies, and free energies of formation of L-valine, L-isoleucine, and L-leucine,
J. Phys. Chem., 1963, 67, 1128-1130. [all data]
Tsuzuki, Harper, et al., 1958
Tsuzuki, T.; Harper, D.O.; Hunt, H.,
Heats of combustion. VII. The heats of combustion of some amino acids,
J. Phys. Chem., 1958, 62, 1594-1595. [all data]
Lemoult, 1904
Lemoult, M.P.,
Remarques sur une serie recenie de determinations calorimetriques,
Compt. Rend., 1904, 663-635. [all data]
Hutchens, Cole, et al., 1960
Hutchens, J.O.; Cole, A.G.; Stout, J.W.,
Heat capacities from 11 to 305K. and entropies of L-alanine and glycine,
J. Am. Chem. Soc., 1960, 82, 4813-4815. [all data]
Daurel, Delhaes, et al., 1975
Daurel, M.; Delhaes, P.; Dupart, E.,
Variations thermiques, entre 1 et 300K, de la chaleur specifique de la L-alanine, tri(L-alanine) et de la poly(L-alanine),
Biopolymers, 1975, 14, 801-823. [all data]
Badelin, Kulikov, et al., 1990
Badelin, V.G.; Kulikov, O.V.; Batagin, V.S.; Udzig, E.; Zielenkiewicz, A.; Zielenkiewicz, W.; Krestov, G.A.,
Physico-chemical properties of peptides and their solutions,
Thermochim. Acta, 1990, 169, 81-93. [all data]
Kulikov, Kozlov, et al., 1989
Kulikov, O.V.; Kozlov, V.A.; Malenkina, L.I.; Badelin, V.G.,
Heat capacities of amino acids and peptides and excess characteristics ot their aqueous solutions, Sbornik Nauch. Trud., Termodin. Rast. neelect., Ivanovo,
Inst. nevod. rast., 1989, Akad. [all data]
Hunter and Lias, 1998
Hunter, E.P.; Lias, S.G.,
Evaluated Gas Phase Basicities and Proton Affinities of Molecules: An Update,
J. Phys. Chem. Ref. Data, 1998, 27, 3, 413-656, https://doi.org/10.1063/1.556018
. [all data]
Bouchoux and Salpin, 2003
Bouchoux, G.; Salpin, J.Y.,
Gas-phase basicity of glycine, alanine, proline, serine, lysine, histidine and some of their peptides by the thermokinetic method,
European J. Mass Spectrometry, 2003, 9, 391-402. [all data]
Hahn and Wesdemiotis, 2003
Hahn, I.S.; Wesdemiotis, C.,
Protonation Thermochemistry of beta-Alanine. An Evaluation of Proton Affinities and Entropies Determined by the Extended Kinetic Method,
Int. J. Mass Spectrometry, 2003, 222, 465. [all data]
Cassady, Carr, et al., 1995
Cassady, C.J.; Carr, S.R.; Zhang, K.; Chung-Phillips, C.,
Experimental and Ab Intio Studies of Protonations of Alanine and Samll Peptides of Alanine and Glycine,
J. Org. Chem., 1995, 60, 1704. [all data]
Wu and Lebrilla, 1995
Wu, J.; Lebrilla, C.B.,
Intrinsic Basicity of Oligomeric Peptides that Contain Glycine, Alanine, and Valine - The Effects of the Alkyl Side Chain on Proton Transfer Reactions,
J. Am. Soc. Mass Spectrom., 1995, 6, 91. [all data]
Klasinc, 1976
Klasinc, L.,
Application of photoelectron spectroscopy to biologically active molecules and their constituent parts,
J. Electron Spectrosc. Relat. Phenom., 1976, 8, 161. [all data]
Debies and Rabalais, 1974
Debies, T.P.; Rabalais, J.W.,
Electronic structure of amino acids and ureas,
J. Electron Spectrosc. Relat. Phenom., 1974, 3, 315. [all data]
Slifkin and Allison, 1967
Slifkin, M.A.; Allison, A.C.,
Measurement of ionization potentials from contact charge transfer spectra,
Nature, 1967, 215, 949. [all data]
Jones, Bernier, et al., 2007
Jones, C.M.; Bernier, M.; Carson, E.; Colyer, K.E.; Metz, R.; Pawlow, A.; Wischow, E.D.; Webb, I.; Andriole, E.J.; Poutsma, J.C.,
Gas-phase Acities of the 20 Protein Amino Acids,
Int. J. Mass Spectrom., 2007, 267, 1-3, 54-62, https://doi.org/10.1016/j.ijms.2007.02.018
. [all data]
Locke and McIver, 1983
Locke, M.J.; McIver, R.T., Jr.,
Effect of Solvation on the Acid/Base Properties of Glycine,
J. Am. Chem. Soc., 1983, 105, 4226. [all data]