2,3-Diaminobutane
- Formula: C4H12N2
- Molecular weight: 88.1515
- IUPAC Standard InChIKey: GHWVXCQZPNWFRO-UHFFFAOYSA-N
- CAS Registry Number: 563-86-0
- Chemical structure:
View 3d structure (requires JavaScript / HTML 5) - Permanent link for this species. Use this link for bookmarking this species for future reference.

Gas phase ion energetics data

Data compiled by: Sharon G. Lias, John E. Bartmess, Joel F. Liebman, John L. Holmes, Rhoda D. Levin, and W. Gary Mallard
Appearance energy determinations
Ion | AE (eV) | Other Products | Method | Reference | Comment |
---|---|---|---|---|---|
C2H6N+ | 8.86 | CH3CHNH2 | EI | Burkey, Castelhano, et al., 1983 |

References

Burkey, Castelhano, et al., 1983
Burkey, T.J.; Castelhano, A.L.; Griller, D.; Lossing, F.P.,
Heats of formation and ionization potentials of some α-aminoalkyl radicals,
J. Am. Chem. Soc., 1983, 105, 4701. [all data]