Parathion
- Formula: C10H14NO5PS
- Molecular weight: 291.261
- IUPAC Standard InChIKey: LCCNCVORNKJIRZ-UHFFFAOYSA-N
- CAS Registry Number: 56-38-2
- Chemical structure:
View 3d structure (requires JavaScript / HTML 5) - Other names: Phosphorothioic acid, O,O-diethyl O-(4-nitrophenyl) ester; Phosphorothioic acid, O,O-diethyl O-(p-nitrophenyl) ester; Alkron; Alleron; American Cyanamid 3422; Aphamite; Aralo; AAT; AATP; Bayer E-605; Bladan F; Diethyl p-Nitrophenyl phosphorothionate; Diethyl p-nitrophenyl thionophosphate; Diethyl parathion; Diethyl 4-nitrophenyl phosphorothionate; DNTP; E 605; E 605F; Ekatox; Ethyl Parathion; Etilon; ENT 15108; Folidol; Folidol Oil; Folidol E; Folidol E-605; Fosferno; Fostox; Gearphos; Lirothion; Niran; Nitrostigmine; Nourithion; NIUIF 100; O,O-Diethyl O-(p-Nitrophenyl) phosphorothioate; O,O-Diethyl O-(p-nitrophenyl) thiophosphate; Oleofos 20; Oleoparaphene; Oleoparathion; Pacol; Paramar 50; Paraphos; Parathion-ethyl; Penncap E; Rhodiasol; Rhodiatox; RB; Super Rodiatox; SNP; Thiophos; Thiophos 3422; Vitrex; AC 3422; B 404; Bladan; BAY E-605; Compound 3422; Corothion; Corthione; Danthion; Diethyl p-nitrophenyl thiophosphate; DPP; Ecatox; Etylparation; Fosfex; Fosfive; Fosova; Fostern; Genithion; Kolphos; Kypthion; Lethalaire G-54; Murfos; NCI-C00226; O,O-diaethyl-O-(4-nitro-phenyl)-monothiophosphat; O,O-diethyl-O-(4-nitro-fenil)monothiofosfaat; O,O-Diethyl O-(p-nitrophenyl) thionophosphate; O,O-Diethyl O-(4-nitrophenyl) thiophosphate; O,O-Diethyl-O-p-nitrofenylester kyseliny thiofosforecne; O,O-Dietil-O-(4-nitro-fenil)-monotiofosfato; Orthophos; PAC; Panthion; Paramar; Parathene; Parawet; Pestox plus; Pethion; Phoskil; Phosphemol; Phosphenol; Phosphostigmine; Stabilized ethyl parathion; Stathion; Strathion; Sulphos; T-47; Thiophosphate de O,O-diethyle et de O-(4-nitrophenyle); Tiofos; TOX 47; Vapophos; ACC 3422; Corthion; Diethyl para-nitrophenol thiophosphate; Drexel parathion 8E; E 605 FORTE; Ethlon; Folidol E & E 605; Fosfermo; NA 2783; Niran E-4; Nitrostigmin; Nitrostygmine; OMS 19; Paradust; Parathion-aethyl; Parathion mixture; Phenol, p-nitro-, O-ester with O,O-diethylphosphorothioate; Rcra waste number P089; Rhodiatrox; Selephos; Sixty-three special E.C. insecticide; Soprathion; Thiofos; Thiomex; Murphos; O,O-Diethyl-O-(4-nitrophenyl) phosphorothioate; S.N.P.; Diethyl 4-nitrophenyl phosphorothioate; Ecatox 20; Galpar; Oleoparathene; Parathion A; ENT 15,108; Thiophos Parathion 4 E.C.; Kwell; Isotox; Jacutin; Kokotine; Vitrex HGI; Diethoxy, nitro-phenoxy phosphorothioate; Rodiatox; Ethyle-parathion; O,O-diethyl O-4-nitrophenyl phosphorothioate (parathion)

Phase change data

Data compiled as indicated in comments:
TRC - Thermodynamics Research Center, NIST Boulder Laboratories, Chris Muzny director
AC - William E. Acree, Jr., James S. Chickos
Quantity | Value | Units | Method | Reference | Comment |
---|---|---|---|---|---|
Tfus | 278.53 | K | N/A | Donnelly, Drewes, et al., 1990 | Uncertainty assigned by TRC = 0.2 K; TRC |
Tfus | 279.4 | K | N/A | Plato and Glasgow, 1969 | Uncertainty assigned by TRC = 0.1 K; TRC |
Enthalpy of sublimation
ΔsubH (kJ/mol) | Temperature (K) | Reference | Comment |
---|---|---|---|
100.6 | 308. | Spencer, Shoup, et al., 1979 | Based on data from 298. to 318. K. See also Spencer and Cliath, 1983.; AC |
Enthalpy of fusion
ΔfusH (kJ/mol) | Temperature (K) | Method | Reference | Comment |
---|---|---|---|---|
15.72 | 278.1 | DSC | Acree, 1991 | See also Donnelly, Drewes, et al., 1990, 2.; AC |

Henry's Law data

Data compiled by: Rolf Sander
Henry's Law constant (water solution)
kH(T) = k°H exp(d(ln(kH))/d(1/T) ((1/T) - 1/(298.15 K)))
k°H = Henry's law constant for solubility in water at 298.15 K (mol/(kg*bar))
d(ln(kH))/d(1/T) = Temperature dependence constant (K)
k°H (mol/(kg*bar)) | d(ln(kH))/d(1/T) (K) | Method | Reference |
---|---|---|---|
820. | L | N/A |

Kovats' RI, non-polar column, isothermal

Column type | Active phase | Temperature (C) | I | Reference | Comment |
---|---|---|---|---|---|
Capillary | OV-1 | 190. | 1956. | Erdmann, Rochholz, et al., 1992 | |
Capillary | OV-1 | 220. | 1971. | Erdmann, Rochholz, et al., 1992 | |
Capillary | SPB-1 | 250. | 1989. | Lora-Tamayo, Rams, et al., 1986 | He; Column length: 25. m; Column diameter: 0.20 mm |

Kovats' RI, non-polar column, temperature ramp

Column type | Active phase | I | Reference | Comment |
---|---|---|---|---|
Capillary | DB-1 | 1961. | Hall, Whitehead, et al., 1986 | He, 6. K/min; Column length: 15. m; Column diameter: 0.25 mm; Tstart: 100. C; Tend: 270. C |
Capillary | DB-5 | 2000. | Hall, Whitehead, et al., 1986 | He, 6. K/min; Column length: 15. m; Column diameter: 0.25 mm; Tstart: 100. C; Tend: 270. C |
Capillary | SE-30 | 1947. | Schepers, Wijsbeek, et al., 1982 | 12. m/0.22 mm/0.45 μm, He, 120. C @ 2. min, 8. K/min, 300. C @ 12. min |
Capillary | SE-30 | 1946. | Schepers, Wijsbeek, et al., 1982 | 25. m/0.49 mm/1.14 μm, 100. C @ 2. min, 8. K/min, 275. C @ 15. min |

Kovats' RI, non-polar column, custom temperature program

Column type | Active phase | I | Reference | Comment |
---|---|---|---|---|
Packed | SE-30 | 1935. | Ramsey, Lee, et al., 1980 | He, Chromosorb G HP (80-100 mesh); Column length: 1.5 m; Program: not specified |

Van Den Dool and Kratz RI, non-polar column, custom temperature program

Column type | Active phase | I | Reference | Comment |
---|---|---|---|---|
Capillary | HP-5MS | 2008. | Hankemeier, Rozenbrand, et al., 1998 | Program: not specified |
Capillary | CP Sil 5 CB | 1962. | Aderjan and Bogusz, 1988 | 10. m/0.53 mm/5.0 μm, He; Program: 100 0C (2 min ) 15 0C/min -> 200 0C 10 0C/min -> 300 0C (8 min hold) |

Normal alkane RI, non-polar column, isothermal

Column type | Active phase | Temperature (C) | I | Reference | Comment |
---|---|---|---|---|---|
Packed | OV-1 | 190. | 1950. | TSunoda, 1986 | Helium, Chromosorb W AW DMCS; Column length: 1. m |

Normal alkane RI, non-polar column, temperature ramp

Column type | Active phase | I | Reference | Comment |
---|---|---|---|---|
Packed | OV-1 | 1940. | TSunoda, 1986 | Helium, Chromosorb W AW DMCS, 4. K/min, 210. C @ 20. min; Column length: 1. m; Tstart: 140. C |
Packed | OV-1 | 1975. | Marozzi, Gambaro, et al., 1982 | Gas Chrom P, 2.5 K/min; Column length: 2. m; Tstart: 120. C; Tend: 200. C |
Packed | SE-30 | 1975. | Marozzi, Gambaro, et al., 1982 | Gas Chrom P, 2.5 K/min; Column length: 2. m; Tstart: 120. C; Tend: 200. C |

Normal alkane RI, non-polar column, custom temperature program

Column type | Active phase | I | Reference | Comment |
---|---|---|---|---|
Capillary | 5 % Phenyl methyl siloxane | 1994. | Department of Food Safety and Welfare, 2006 | 30. m/0.25 mm/0.25 μm, Helium; Program: 50 0C(1 min) 25 0C/min -> 125 0C 10 0C/min -> 300 0C (10 min) |
Capillary | 5 % Phenyl methyl siloxane | 1996. | Department of Food Safety and Welfare, 2006 | 30. m/0.25 mm/0.25 μm, Helium; Program: 50 0C(1 min) 25 0C/min -> 125 0C 10 0C/min -> 300 0C (10 min) |
Capillary | OV-1 | 1941. | Waggott and Davies, 1984 | Hydrogen; Column length: 50. m; Column diameter: 0.32 mm; Program: not specified |
Capillary | OV-1, SE-30, Methyl silicone, SP-2100, OV-101, DB-1, etc. | 1935. | Waggott and Davies, 1984 | Hydrogen; Column length: 50. m; Column diameter: 0.32 mm; Program: not specified |
Capillary | OV-1, SE-30, Methyl silicone, SP-2100, OV-101, DB-1, etc. | 1941. | Waggott and Davies, 1984 | Hydrogen; Column length: 50. m; Column diameter: 0.32 mm; Program: not specified |
Capillary | OV-1, SE-30, Methyl silicone, SP-2100, OV-101, DB-1, etc. | 1942. | Waggott and Davies, 1984 | Hydrogen; Column length: 50. m; Column diameter: 0.32 mm; Program: not specified |
Capillary | OV-1, SE-30, Methyl silicone, SP-2100, OV-101, DB-1, etc. | 1989. | Waggott and Davies, 1984 | Hydrogen; Column length: 50. m; Column diameter: 0.32 mm; Program: not specified |
Capillary | OV-1, SE-30, Methyl silicone, SP-2100, OV-101, DB-1, etc. | 1953. | Waggott and Davies, 1984 | Hydrogen; Column length: 50. m; Column diameter: 0.32 mm; Program: not specified |
Other | Methyl Silicone | 1953. | Ardrey and Moffat, 1981 | Program: not specified |
Other | Methyl Silicone | 1942. | Ardrey and Moffat, 1981 | Program: not specified |

Normal alkane RI, polar column, custom temperature program

Column type | Active phase | I | Reference | Comment |
---|---|---|---|---|
Capillary | Carbowax 20M | 2967. | Tameo and Kiyos, 1991 | Program: not specified |

References

Donnelly, Drewes, et al., 1990
Donnelly, J.R.; Drewes, L.A.; Johnson, R.L.; Munslow, W.D.; Knapp, K.K.; Sovocool, G.W.,
Purity and heat of fusion data for environmental standards as determined by differential scanning calorimetry,
Thermochim. Acta, 1990, 167, 2, 155, https://doi.org/10.1016/0040-6031(90)80476-F
. [all data]
Plato and Glasgow, 1969
Plato, C.; Glasgow, A.R., Jr.,
Differential scanning calorimetry as a general method for determining the purity and heat of fusion of high-purity organic chemicals. Application to 95 compounds,
Anal. Chem., 1969, 41, 2, 330, https://doi.org/10.1021/ac60271a041
. [all data]
Spencer, Shoup, et al., 1979
Spencer, William F.; Shoup, Thomas D.; Cliath, Mark M.; Farmer, Walter J.; Haque, Rizwanul,
Vapor pressures and relative volatility of ethyl and methyl parathion,
J. Agric. Food Chem., 1979, 27, 2, 273-278, https://doi.org/10.1021/jf60222a016
. [all data]
Spencer and Cliath, 1983
Spencer, W.F.; Cliath, M.M.,
Measurement of pesticide vapor pressures, 1983, 57-71, https://doi.org/10.1007/978-1-4612-5462-16
. [all data]
Acree, 1991
Acree, William E.,
Thermodynamic properties of organic compounds: enthalpy of fusion and melting point temperature compilation,
Thermochimica Acta, 1991, 189, 1, 37-56, https://doi.org/10.1016/0040-6031(91)87098-H
. [all data]
Donnelly, Drewes, et al., 1990, 2
Donnelly, J.R.; Drewes, L.A.; Johnson, R.L.; Munslow, W.D.; Knapp, K.K.; Sovocool, G.W.,
Purity and heat of fusion data for environmental standards as determined by differential scanning calorimetry,
Thermochimica Acta, 1990, 167, 2, 155-187, https://doi.org/10.1016/0040-6031(90)80476-F
. [all data]
Hirt and Gisclard, 1951
Hirt, R.C.; Gisclard, J.B.,
Determination of parathion in air samples by ultraviolet absorption spectroscopy,
Anal. Chem., 1951, 23, 1, 185-187. [all data]