2-Butanone, 3-methyl-
- Formula: C5H10O
- Molecular weight: 86.1323
- IUPAC Standard InChIKey: SYBYTAAJFKOIEJ-UHFFFAOYSA-N
- CAS Registry Number: 563-80-4
- Chemical structure:
View 3d structure (requires JavaScript / HTML 5) - Other names: Isopropyl methyl ketone; Ketone, isopropyl methyl; Methyl butanone-2; Methyl isopropyl ketone; 3-Methyl-2-butanone; iso-C3H7COCH3; 2-Acetylpropane; 3-Methylbutan-2-one; MIPK; UN 2397; 2-Methylbutan-3-one; NSC 9379; methylbutanone; 3-Methyl-2-butanoate; 3-methylbutanone

Gas phase thermochemistry data

Data compiled as indicated in comments:
ALS - Hussein Y. Afeefy, Joel F. Liebman, and Stephen E. Stein
GT - Glushko Thermocenter, Russian Academy of Sciences, Moscow
Quantity | Value | Units | Method | Reference | Comment |
---|---|---|---|---|---|
ΔfH°gas | -262.57 ± 0.87 | kJ/mol | Ccb | Harrop, Head, et al., 1970 | ALS |
Constant pressure heat capacity of gas
Cp,gas (J/mol*K) | Temperature (K) | Reference | Comment |
---|---|---|---|
139.58 | 358.15 | Hales J.L., 1967 | GT |
146.82 | 383.15 | ||
154.26 | 408.15 | ||
161.25 | 433.15 | ||
166.77 | 453.15 | ||
172.09 | 473.15 |

Condensed phase thermochemistry data

Data compiled as indicated in comments:
ALS - Hussein Y. Afeefy, Joel F. Liebman, and Stephen E. Stein
DH - Eugene S. Domalski and Elizabeth D. Hearing
Quantity | Value | Units | Method | Reference | Comment |
---|---|---|---|---|---|
ΔfH°liquid | -299.47 ± 0.86 | kJ/mol | Ccb | Harrop, Head, et al., 1970 | ALS |
Quantity | Value | Units | Method | Reference | Comment |
ΔcH°liquid | -3097.2 ± 0.8 | kJ/mol | Ccb | Harrop, Head, et al., 1970 | Corresponding ΔfHºliquid = -299.47 kJ/mol (simple calculation by NIST; no Washburn corrections); ALS |
Quantity | Value | Units | Method | Reference | Comment |
S°liquid | 268.5 | J/mol*K | N/A | Andon, Counsell, et al., 1968 | DH |
Constant pressure heat capacity of liquid
Cp,liquid (J/mol*K) | Temperature (K) | Reference | Comment |
---|---|---|---|
180.0 | 298.15 | Harrop, Head, et al., 1970 | DH |
179.9 | 298.15 | Andon, Counsell, et al., 1968 | T = 10 to 320 K.; DH |

Phase change data

Data compiled as indicated in comments:
BS - Robert L. Brown and Stephen E. Stein
TRC - Thermodynamics Research Center, NIST Boulder Laboratories, Chris Muzny director
ALS - Hussein Y. Afeefy, Joel F. Liebman, and Stephen E. Stein
AC - William E. Acree, Jr., James S. Chickos
DH - Eugene S. Domalski and Elizabeth D. Hearing
Quantity | Value | Units | Method | Reference | Comment |
---|---|---|---|---|---|
Tboil | 367. ± 2. | K | AVG | N/A | Average of 40 out of 41 values; Individual data points |
Quantity | Value | Units | Method | Reference | Comment |
Tfus | 178.75 | K | N/A | Mears, Fookson, et al., 1950 | Uncertainty assigned by TRC = 0.4 K; TRC |
Tfus | 181.15 | K | N/A | Timmermans and Mattaar, 1921 | Uncertainty assigned by TRC = 0.6 K; TRC |
Quantity | Value | Units | Method | Reference | Comment |
Ttriple | 180.01 | K | N/A | Andon, Counsell, et al., 1968, 2 | Uncertainty assigned by TRC = 0.06 K; TRC |
Quantity | Value | Units | Method | Reference | Comment |
Tc | 553.1 | K | N/A | Quadri and Kudchadker, 1991 | Uncertainty assigned by TRC = 0.4 K; TRC |
Tc | 553.4 | K | N/A | Majer and Svoboda, 1985 | |
Tc | 553.4 | K | N/A | Kobe, Crawford, et al., 1955 | Uncertainty assigned by TRC = 0.83 K; TRC |
Quantity | Value | Units | Method | Reference | Comment |
Pc | 38.00 | bar | N/A | Quadri and Kudchadker, 1991 | Uncertainty assigned by TRC = 0.20 bar; TRC |
Pc | 38.50 | bar | N/A | Kobe, Crawford, et al., 1955 | Uncertainty assigned by TRC = 0.483 bar; TRC |
Quantity | Value | Units | Method | Reference | Comment |
ρc | 3.23 | mol/l | N/A | Kobe, Crawford, et al., 1955 | Uncertainty assigned by TRC = 0.29 mol/l; TRC |
Quantity | Value | Units | Method | Reference | Comment |
ΔvapH° | 36.87 | kJ/mol | N/A | Majer and Svoboda, 1985 | |
ΔvapH° | 36.81 | kJ/mol | V | Uchytilova, Majer, et al., 1983 | ALS |
ΔvapH° | 36.8 | kJ/mol | C | Uchytilova, Majer, et al., 1983 | AC |
ΔvapH° | 36.9 | kJ/mol | N/A | Ambrose, Ellender, et al., 1975 | AC |
Enthalpy of vaporization
ΔvapH (kJ/mol) | Temperature (K) | Method | Reference | Comment |
---|---|---|---|---|
32.35 | 367.4 | N/A | Majer and Svoboda, 1985 | |
35.5 | 326. | A | Stephenson and Malanowski, 1987 | Based on data from 311. to 369. K.; AC |
33.8 | 378. | A | Stephenson and Malanowski, 1987 | Based on data from 363. to 415. K.; AC |
32.6 | 420. | A | Stephenson and Malanowski, 1987 | Based on data from 405. to 500. K.; AC |
35.0 | 343. | A | Stephenson and Malanowski, 1987 | Based on data from 328. to 377. K. See also Ambrose, Ellender, et al., 1975.; AC |
35.0 ± 0.1 | 327. | C | Hales, Lees, et al., 1967 | AC |
33.8 ± 0.1 | 346. | C | Hales, Lees, et al., 1967 | AC |
32.3 ± 0.1 | 367. | C | Hales, Lees, et al., 1967 | AC |
Enthalpy of vaporization
ΔvapH =
A exp(-βTr) (1 − Tr)β
ΔvapH =
Enthalpy of vaporization (at saturation pressure)
(kJ/mol)
Tr = reduced temperature (T / Tc)
View plot Requires a JavaScript / HTML 5 canvas capable browser.
Temperature (K) | A (kJ/mol) | β | Tc (K) | Reference | Comment |
---|---|---|---|---|---|
298. to 368. | 53.89 | 0.2911 | 553.4 | Majer and Svoboda, 1985 |
Antoine Equation Parameters
log10(P) = A − (B / (T + C))
P = vapor pressure (bar)
T = temperature (K)
View plot Requires a JavaScript / HTML 5 canvas capable browser.
Temperature (K) | A | B | C | Reference | Comment |
---|---|---|---|---|---|
253.3 to 362.1 | 5.62559 | 1806.925 | -40.618 | Stull, 1947 | Coefficents calculated by NIST from author's data. |
Enthalpy of fusion
ΔfusH (kJ/mol) | Temperature (K) | Reference | Comment |
---|---|---|---|
9.343 | 180.01 | Andon, Counsell, et al., 1968 | DH |
9.34 | 180. | Domalski and Hearing, 1996 | AC |
Entropy of fusion
ΔfusS (J/mol*K) | Temperature (K) | Reference | Comment |
---|---|---|---|
51.90 | 180.01 | Andon, Counsell, et al., 1968 | DH |

Reaction thermochemistry data

Data compiled as indicated in comments:
B - John E. Bartmess
ALS - Hussein Y. Afeefy, Joel F. Liebman, and Stephen E. Stein
Individual Reactions
C5H9O- + =
By formula: C5H9O- + H+ = C5H10O
Quantity | Value | Units | Method | Reference | Comment |
---|---|---|---|---|---|
ΔrH° | 1545. ± 11. | kJ/mol | G+TS | Chyall, Brickhouse, et al., 1994 | gas phase; By equilibration, more substituted site is less acidic than Me by 2.3 kcal/mol; B |
Quantity | Value | Units | Method | Reference | Comment |
ΔrG° | 1518. ± 10. | kJ/mol | IMRE | Chyall, Brickhouse, et al., 1994 | gas phase; By equilibration, more substituted site is less acidic than Me by 2.3 kcal/mol; B |
C5H9O- + =
By formula: C5H9O- + H+ = C5H10O
Quantity | Value | Units | Method | Reference | Comment |
---|---|---|---|---|---|
ΔrH° | 1537. ± 9.2 | kJ/mol | G+TS | Cumming and Kebarle, 1978 | gas phase; Structure assignment revised to less-substituted site: Chyall, Brickhouse, et al., 1994; B |
Quantity | Value | Units | Method | Reference | Comment |
ΔrG° | 1508. ± 8.4 | kJ/mol | IMRE | Cumming and Kebarle, 1978 | gas phase; Structure assignment revised to less-substituted site: Chyall, Brickhouse, et al., 1994; B |
(CAS Reg. No. 60375-60-2 • 4294967295) +
= CAS Reg. No. 60375-60-2
By formula: (CAS Reg. No. 60375-60-2 • 4294967295C5H10O) + C5H10O = CAS Reg. No. 60375-60-2
Quantity | Value | Units | Method | Reference | Comment |
---|---|---|---|---|---|
ΔrH° | 169. ± 8.8 | kJ/mol | N/A | Haas and Harrison, 1993 | gas phase; Both metastable and 50 eV collision energy.; B |
ΔrH° | 168. ± 12. | kJ/mol | Ther | Boand, Houriet, et al., 1983 | gas phase; value altered from reference due to change in acidity scale; B |
By formula: C7H16O2 + H2O = C5H10O + 2CH4O
Quantity | Value | Units | Method | Reference | Comment |
---|---|---|---|---|---|
ΔrH° | 20.33 ± 0.04 | kJ/mol | Cm | Wiberg and Squires, 1979 | liquid phase; Heat of hydrolysis; ALS |
By formula: C5H12O = H2 + C5H10O
Quantity | Value | Units | Method | Reference | Comment |
---|---|---|---|---|---|
ΔrH° | 53.8 ± 1.6 | kJ/mol | Eqk | Connett, 1970 | gas phase; ALS |

Gas phase ion energetics data

Data evaluated as indicated in comments:
HL - Edward P. Hunter and Sharon G. Lias
L - Sharon G. Lias
Data compiled as indicated in comments:
B - John E. Bartmess
LLK - Sharon G. Lias, Rhoda D. Levin, and Sherif A. Kafafi
RDSH - Henry M. Rosenstock, Keith Draxl, Bruce W. Steiner, and John T. Herron
Quantity | Value | Units | Method | Reference | Comment |
---|---|---|---|---|---|
IE (evaluated) | 9.31 ± 0.02 | eV | N/A | N/A | L |
Quantity | Value | Units | Method | Reference | Comment |
Proton affinity (review) | 836.3 | kJ/mol | N/A | Hunter and Lias, 1998 | HL |
Quantity | Value | Units | Method | Reference | Comment |
Gas basicity | 804.4 | kJ/mol | N/A | Hunter and Lias, 1998 | HL |
Ionization energy determinations
IE (eV) | Method | Reference | Comment |
---|---|---|---|
9.298 ± 0.005 | PE | Hernandez, Masclet, et al., 1977 | LLK |
9.30 ± 0.01 | PE | Mouvier and Hernandez, 1975 | LLK |
9.30 ± 0.04 | EI | Mouvier and Hernandez, 1975 | LLK |
9.36 | PE | Tam, Yee, et al., 1974 | LLK |
9.30 ± 0.01 | PE | Cocksey, Eland, et al., 1971 | LLK |
9.30 ± 0.02 | PI | Murad and Inghram, 1964 | RDSH |
9.32 ± 0.02 | PI | Watanabe, Nakayama, et al., 1962 | RDSH |
Appearance energy determinations
Ion | AE (eV) | Other Products | Method | Reference | Comment |
---|---|---|---|---|---|
C2H3O+ | 10.68 | ? | EI | Mouvier and Hernandez, 1975 | LLK |
C2H3O+ | 10.4 | iso-C3H7 | PI | Murad and Inghram, 1964 | RDSH |
C4H7O+ | 9.9 | ? | EI | Mouvier and Hernandez, 1975 | LLK |
C4H7O+ | 9.94 | CH3 | PI | Murad and Inghram, 1964 | RDSH |
De-protonation reactions
C5H9O- + =
By formula: C5H9O- + H+ = C5H10O
Quantity | Value | Units | Method | Reference | Comment |
---|---|---|---|---|---|
ΔrH° | 1545. ± 11. | kJ/mol | G+TS | Chyall, Brickhouse, et al., 1994 | gas phase; By equilibration, more substituted site is less acidic than Me by 2.3 kcal/mol; B |
Quantity | Value | Units | Method | Reference | Comment |
ΔrG° | 1518. ± 10. | kJ/mol | IMRE | Chyall, Brickhouse, et al., 1994 | gas phase; By equilibration, more substituted site is less acidic than Me by 2.3 kcal/mol; B |
C5H9O- + =
By formula: C5H9O- + H+ = C5H10O
Quantity | Value | Units | Method | Reference | Comment |
---|---|---|---|---|---|
ΔrH° | 1537. ± 9.2 | kJ/mol | G+TS | Cumming and Kebarle, 1978 | gas phase; Structure assignment revised to less-substituted site: Chyall, Brickhouse, et al., 1994; B |
Quantity | Value | Units | Method | Reference | Comment |
ΔrG° | 1508. ± 8.4 | kJ/mol | IMRE | Cumming and Kebarle, 1978 | gas phase; Structure assignment revised to less-substituted site: Chyall, Brickhouse, et al., 1994; B |

Kovats' RI, non-polar column, isothermal

Column type | Active phase | Temperature (C) | I | Reference | Comment |
---|---|---|---|---|---|
Capillary | OV-1 | 333. | 640.9 | Hu, Lu, et al., 2006 | |
Capillary | HP-1 | 110. | 642.78 | Héberger, Görgényi, et al., 2002 | 50. m/0.32 mm/1.05 μm |
Capillary | HP-1 | 30. | 639.36 | Héberger, Görgényi, et al., 2002 | 50. m/0.32 mm/1.05 μm |
Capillary | HP-1 | 50. | 639.89 | Héberger, Görgényi, et al., 2002 | 50. m/0.32 mm/1.05 μm |
Capillary | HP-1 | 70. | 640.49 | Héberger, Görgényi, et al., 2002 | 50. m/0.32 mm/1.05 μm |
Capillary | HP-1 | 90. | 641.53 | Héberger, Görgényi, et al., 2002 | 50. m/0.32 mm/1.05 μm |
Capillary | HP-1 | 110. | 643. | Héberger and Görgényi, 1999 | 50. m/0.32 mm/1.05 μm, N2 |
Capillary | HP-1 | 50. | 640. | Héberger and Görgényi, 1999 | 50. m/0.32 mm/1.05 μm, N2 |
Capillary | HP-1 | 70. | 640. | Héberger and Görgényi, 1999 | 50. m/0.32 mm/1.05 μm, N2 |
Capillary | HP-1 | 90. | 642. | Héberger and Görgényi, 1999 | 50. m/0.32 mm/1.05 μm, N2 |
Packed | SE-30 | 100. | 646. | Winskowski, 1983 | Gaschrom Q; Column length: 2. m |
Packed | Apiezon L | 130. | 627. | Wehrli and Kováts, 1959 | Celite; Column length: 2.25 m |

Kovats' RI, non-polar column, temperature ramp

Column type | Active phase | I | Reference | Comment |
---|---|---|---|---|
Capillary | OV-101 | 650. | Ohnishi and Shibamoto, 1984 | 2. K/min; Column length: 50. m; Column diameter: 0.23 mm; Tstart: 80. C; Tend: 200. C |

Kovats' RI, polar column, isothermal

Column type | Active phase | Temperature (C) | I | Reference | Comment |
---|---|---|---|---|---|
Capillary | HP-Innowax | 110. | 965.0 | Héberger and Görgényi, 1999 | 30. m/0.32 mm/0.5 μm |
Capillary | HP-Innowax | 50. | 949.4 | Héberger and Görgényi, 1999 | 30. m/0.32 mm/0.5 μm |
Capillary | HP-Innowax | 70. | 954.4 | Héberger and Görgényi, 1999 | 30. m/0.32 mm/0.5 μm |
Capillary | HP-Innowax | 90. | 959.6 | Héberger and Görgényi, 1999 | 30. m/0.32 mm/0.5 μm |

Van Den Dool and Kratz RI, non-polar column, temperature ramp

Column type | Active phase | I | Reference | Comment |
---|---|---|---|---|
Capillary | Petrocol DH | 647.2 | Censullo, Jones, et al., 2003 | 50. m/0.25 mm/0.5 μm, He, 35. C @ 10. min, 3. K/min, 200. C @ 10. min |
Capillary | DB-1 | 636. | Kim, 2001 | 60. m/0.32 mm/1. μm, He, 40. C @ 5. min, 2. K/min; Tend: 220. C |

Van Den Dool and Kratz RI, non-polar column, custom temperature program

Column type | Active phase | I | Reference | Comment |
---|---|---|---|---|
Capillary | BPX-5 | 673. | Owens J.D., Allagheny N., et al., 1997 | 50. m/0.32 mm/0.5 μm, He; Program: OC => 60C/min => 60C(5min) => 4C/min => 250C(20min) |

Van Den Dool and Kratz RI, polar column, temperature ramp

Column type | Active phase | I | Reference | Comment |
---|---|---|---|---|
Capillary | Carbowax | 943.2 | Censullo, Jones, et al., 2003 | 60. m/0.25 mm/0.5 μm, He, 50. C @ 10. min, 5. K/min, 250. C @ 10. min |
Capillary | DB-Wax | 929. | Shimoda, Peralta, et al., 1996 | 60. m/0.25 mm/0.25 μm, He, 3. K/min; Tstart: 50. C; Tend: 230. C |
Capillary | DB-Wax | 936. | Shimoda, Shiratsuchi, et al., 1996 | 60. m/0.25 mm/0.25 μm, He, 2. K/min, 230. C @ 60. min; Tstart: 50. C |
Capillary | Supelcowax-10 | 929. | Tanchotikul and Hsieh, 1989 | 60. m/0.25 mm/0.25 μm, 40. C @ 5. min, 2. K/min, 175. C @ 20. min |
Capillary | Supelcowax-10 | 929. | Tanchotikul and Hsieh, 1989 | 60. m/0.25 mm/0.25 μm, 40. C @ 5. min, 2. K/min, 175. C @ 20. min |

Van Den Dool and Kratz RI, polar column, custom temperature program

Column type | Active phase | I | Reference | Comment |
---|---|---|---|---|
Capillary | DB-Wax | 918. | Radovic, Careri, et al., 2001 | 30. m/0.25 mm/0.25 μm; Program: 30C(8min) => 4C/min => 60C => 6C/min => 160C => 20C/min => 200C(1min) |

Normal alkane RI, non-polar column, isothermal

Column type | Active phase | Temperature (C) | I | Reference | Comment |
---|---|---|---|---|---|
Capillary | OV-1 | 60. | 640. | Amboni, Junkes, et al., 2002 | |
Packed | Apieson L | 120. | 625. | Kurdina, Markovich, et al., 1969 | not specified, not specified |

Normal alkane RI, non-polar column, temperature ramp

Column type | Active phase | I | Reference | Comment |
---|---|---|---|---|
Capillary | OV-101 | 641. | Zenkevich, Eliseenkov, et al., 2011 | 25. m/0.20 mm/0.25 μm, Nitrogen, 6. K/min; Tstart: 40. C; Tend: 240. C |
Capillary | SPB-5 | 657. | Sivadier, Ratel, et al., 2009 | 60. m/0.32 mm/1.00 μm, 40. C @ 5. min, 3. K/min, 230. C @ 10. min |
Capillary | HP-5 | 666.1 | Leffingwell and Alford, 2005 | 60. m/0.32 mm/0.25 μm, He, 30. C @ 2. min, 2. K/min, 260. C @ 28. min |
Capillary | RSL-200 | 628. | Ngassoum, Jirovetz, et al., 2001 | 30. m/0.32 mm/0.25 μm, H2, 40. C @ 5. min, 6. K/min, 280. C @ 5. min |
Capillary | DB-1 | 638. | Chen and Ho, 1999 | 60. m/0.32 mm/1. μm, He, 2. K/min; Tstart: 40. C; Tend: 260. C |
Capillary | DB-1 | 659. | Lu, Yu, et al., 1997 | 60. m/0.32 mm/1. μm, He, 40. C @ 2. min, 2. K/min, 280. C @ 40. min |
Capillary | HP-5 | 654. | Larsen and Frisvad, 1995 | 35. C @ 2. min, 6. K/min; Tend: 200. C |
Capillary | OV-101 | 628. | Misharina, Golovnya, et al., 1991 | 50. m/0.32 mm/0.5 μm, He, 4. K/min; Tstart: 50. C; Tend: 250. C |
Capillary | DB-1 | 639. | Habu, Flath, et al., 1985 | 3. K/min; Column length: 50. m; Column diameter: 0.32 mm; Tstart: 0. C; Tend: 250. C |
Capillary | OV-101 | 637. | del Rosario, de Lumen, et al., 1984 | He, 0. C @ 1. min, 3. K/min; Column length: 50. m; Column diameter: 0.31 mm; Tend: 225. C |

Normal alkane RI, non-polar column, custom temperature program

Column type | Active phase | I | Reference | Comment |
---|---|---|---|---|
Capillary | HP-5 | 658. | Rotsatschakul, Visesanguan, et al., 2009 | 60. m/0.25 mm/0.25 μm, Helium; Program: 30 0C (2 min) 2 0Cmin -> 60 0C 10 0C/min -> 100 0C 20 0C/min -> 140 0C 10 0C/min -> 200 0C (10 min) |
Capillary | Methyl Silicone | 641. | Feng and Mu, 2007 | Program: not specified |
Capillary | HP-5 | 653. | Thierry, Maillard, et al., 2005 | 60. m/0.32 mm/1. μm; Program: not specified |
Capillary | HP-1 | 640. | Junkes, Amboni, et al., 2004 | Program: not specified |
Capillary | Polydimethyl siloxane | 640. | Junkes, Castanho, et al., 2003 | Program: not specified |
Capillary | Methyl Silicone | 641. | Estrada and Gutierrez, 1999 | Program: not specified |
Capillary | SPB-1 | 642. | Flanagan, Streete, et al., 1997 | 60. m/0.53 mm/5. μm, He; Program: 40C(6min) => 5C/min => 80C => 10C/min => 200C |
Capillary | Polydimethyl siloxanes | 641. | Zenkevich and Chupalov, 1996 | Program: not specified |
Capillary | DB-1 | 635. | Ciccioli, Cecinato, et al., 1994 | 60. m/0.32 mm/0.25 μm; Program: not specified |
Capillary | DB-1 | 636. | Ciccioli, Brancaleoni, et al., 1993 | 60. m/0.32 mm/0.25 μm; Program: 3 min at 5 C; 5 - 50 C at 3 deg/min; 50 - 220 C at 5 deg/min |
Capillary | SPB-1 | 642. | Strete, Ruprah, et al., 1992 | 60. m/0.53 mm/5.0 μm, Helium; Program: 40 0C (6 min) 5 0C/min -> 80 0C 10 0C/min -> 200 0C |
Capillary | SPB-1 | 650. | Strete, Ruprah, et al., 1992 | 60. m/0.53 mm/5.0 μm, Helium; Program: not specified |
Capillary | SE-30 | 647. | P'yanova, Zvereva, et al., 1987 | Column length: 25. m; Column diameter: 0.25 mm; Program: not specified |
Capillary | OV-1, SE-30, Methyl silicone, SP-2100, OV-101, DB-1, etc. | 651. | Waggott and Davies, 1984 | Hydrogen; Column length: 50. m; Column diameter: 0.32 mm; Program: not specified |
Capillary | OV-1 | 650. | Ramsey and Flanagan, 1982 | Program: not specified |

Normal alkane RI, polar column, temperature ramp

Column type | Active phase | I | Reference | Comment |
---|---|---|---|---|
Capillary | DB-Wax | 929. | Choi, 2004 | 60. m/0.25 mm/0.25 μm, N2, 70. C @ 2. min, 2. K/min, 230. C @ 20. min |
Capillary | DB-Wax | 925. | Tanaka, Yamauchi, et al., 2003 | 30. m/0.25 mm/0.25 μm, 30. C @ 1. min, 4. K/min; Tend: 250. C |
Capillary | DB-Wax | 927. | Tanaka, Yamauchi, et al., 2003 | 30. m/0.25 mm/0.25 μm, 30. C @ 1. min, 4. K/min; Tend: 250. C |
Capillary | Supelcowax-10 | 989. | Girard and Durance, 2000 | 60. m/0.25 mm/0.25 μm, He, 35. C @ 10. min, 4. K/min; Tend: 200. C |
Capillary | CP-Wax 52CB | 956. | Hwan and Chou, 1999 | 50. m/0.32 mm/0.22 μm, H2, 60. C @ 4. min, 2. K/min, 190. C @ 21. min |

Normal alkane RI, polar column, custom temperature program

Column type | Active phase | I | Reference | Comment |
---|---|---|---|---|
Capillary | SOLGel-Wax | 929. | Johanningsmeier and McFeeters, 2011 | 30. m/0.25 mm/0.25 μm, Helium; Program: 40 0C (2 min) 5 0C/min -> 140 0C 10 0C/min -> 250 0C (3 min) |
Capillary | SOLGel-Wax | 929. | Johanningsmeier and McFeeters, 2011 | 30. m/0.25 mm/0.25 μm, Helium; Program: not specified |
Capillary | DB-Wax | 970. | Gyawalia, Seo, et al., 2006 | 60. m/0.2 mm/0.25 μm, He; Program: 40C(3min) => 2C/min => 150C => 4C/min => 220C(20min) => 5C/min => 230C |
Capillary | Innowax | 949. | Junkes, Amboni, et al., 2004 | Program: not specified |
Capillary | Carbowax 20M | 936. | Ramsey and Flanagan, 1982 | Program: not specified |

References

Harrop, Head, et al., 1970
Harrop, D.; Head, A.J.; Lewis, G.B.,
Thermodynamic properties of organic oxygen compounds. 22. Enthalpies of combustion of some aliphatic ketones,
J. Chem. Thermodyn., 1970, 2, 203-210. [all data]
Hales J.L., 1967
Hales J.L.,
Thermodynamic properties of organic oxygen compounds. Part 18. Vapor heat capacities and heats of vaporization of ethyl ketone, ethyl propyl ketone, methyl isopropyl ketone, and methyl phenyl ether,
Trans. Faraday Soc., 1967, 63, 1876-1879. [all data]
Andon, Counsell, et al., 1968
Andon, R.J.L.; Counsell, J.F.; Martin, J.F.,
Thermodynamic properties of organic oxygen compounds. Part XX. The low-temperature heat capacity and entropy of C4 and C5 ketones,
J. Chem. Soc. A, 1968, 1894-1897. [all data]
Mears, Fookson, et al., 1950
Mears, T.W.; Fookson, A.; Pomerantz, P.; Rich, E.H.; Dussinger, C.S.; Howard, F.L.,
Syntheses and Properties of Two Olefins, Six Paraffins, and Their Intermediates,
J. Res. Natl. Bur. Stand. (U. S.), 1950, 44, 299. [all data]
Timmermans and Mattaar, 1921
Timmermans, J.; Mattaar, J.F.,
Freezing points of orgainic substances VI. New experimental determinations.,
Bull. Soc. Chim. Belg., 1921, 30, 213. [all data]
Andon, Counsell, et al., 1968, 2
Andon, R.J.L.; Counsell, J.F.; Martin, J.F.,
Thermodynamic properties of organic oxygen compounds. Part XX. The low- temperature heat capacity and entropy of C4 and C5 ketones.,
J. Chem. Soc. A, 1968, 1968, 1894-7. [all data]
Quadri and Kudchadker, 1991
Quadri, S.K.; Kudchadker, A.P.,
Measurement of the critical temperatures and critical pressures of some thermally stable or mildly unstable esters, ketones, and ethers,
J. Chem. Thermodyn., 1991, 23, 129-34. [all data]
Majer and Svoboda, 1985
Majer, V.; Svoboda, V.,
Enthalpies of Vaporization of Organic Compounds: A Critical Review and Data Compilation, Blackwell Scientific Publications, Oxford, 1985, 300. [all data]
Kobe, Crawford, et al., 1955
Kobe, K.A.; Crawford, H.R.; Stephenson, R.W.,
Critical Properties and Vapor Pressures of Some Ketones,
Ind. Eng. Chem., 1955, 47, 1767-72. [all data]
Uchytilova, Majer, et al., 1983
Uchytilova, V.; Majer, V.; Svoboda, V.; Hynek, V.,
Enthalpies of vaporization and cohesive enrgies for seven aliphatic ketones,
J. Chem. Thermodyn., 1983, 15, 853-858. [all data]
Ambrose, Ellender, et al., 1975
Ambrose, D.; Ellender, J.H.; Lees, E.B.; Sprake, C.H.S.; Townsend, R.,
Thermodynamic properties of organic oxygen compounds XXXVIII. Vapour pressures of some aliphatic ketones,
The Journal of Chemical Thermodynamics, 1975, 7, 5, 453-472, https://doi.org/10.1016/0021-9614(75)90275-X
. [all data]
Stephenson and Malanowski, 1987
Stephenson, Richard M.; Malanowski, Stanislaw,
Handbook of the Thermodynamics of Organic Compounds, 1987, https://doi.org/10.1007/978-94-009-3173-2
. [all data]
Hales, Lees, et al., 1967
Hales, J.L.; Lees, E.B.; Ruxton, D.J.,
Thermodynamic properties of organic oxygen compounds. Part 18.-Vapour heat capacities and heats of vaporization of ethyl ketone, ethyl propyl ketone, methyl isopropyl ketone, and methyl phenyl ether,
Trans. Faraday Soc., 1967, 63, 1876. [all data]
Stull, 1947
Stull, Daniel R.,
Vapor Pressure of Pure Substances. Organic and Inorganic Compounds,
Ind. Eng. Chem., 1947, 39, 4, 517-540, https://doi.org/10.1021/ie50448a022
. [all data]
Domalski and Hearing, 1996
Domalski, Eugene S.; Hearing, Elizabeth D.,
Heat Capacities and Entropies of Organic Compounds in the Condensed Phase. Volume III,
J. Phys. Chem. Ref. Data, 1996, 25, 1, 1, https://doi.org/10.1063/1.555985
. [all data]
Chyall, Brickhouse, et al., 1994
Chyall, L.J.; Brickhouse, M.D.; Schnute, M.E.; Squires, R.R.,
Kinetic versus thermodynamic control in the deprotonation of unsymmetrical ketones in the gas phase,
J. Am. Chem. Soc., 1994, 116, 19, 8681, https://doi.org/10.1021/ja00098a031
. [all data]
Cumming and Kebarle, 1978
Cumming, J.B.; Kebarle, P.,
Summary of gas phase measurements involving acids AH. Entropy changes in proton transfer reactions involving negative ions. Bond dissociation energies D(A-H) and electron affinities EA(A),
Can. J. Chem., 1978, 56, 1. [all data]
Haas and Harrison, 1993
Haas, M.J.; Harrison, A.G.,
The Fragmentation of Proton-Bound Cluster Ions and the Gas-Phase Acidities of Alcohols,
Int. J. Mass Spectrom. Ion Proc., 1993, 124, 2, 115, https://doi.org/10.1016/0168-1176(93)80003-W
. [all data]
Boand, Houriet, et al., 1983
Boand, G.; Houriet, R.; Baumann, T.,
The gas phase acidity of aliphatic alcohols,
J. Am. Chem. Soc., 1983, 105, 2203. [all data]
Wiberg and Squires, 1979
Wiberg, K.B.; Squires, R.R.,
Thermodynamics of hydrolysis aliphatic ketals. An entropy component of steric effects,
J. Am. Chem. Soc., 1979, 101, 5512-5515. [all data]
Connett, 1970
Connett, J.E.,
Chemical equilibria. Part III. Dehydrogenation of pentan-1-ol, pentan-2-ol, and 3-methylbutan-2-ol,
J. Chem. Soc. A, 1970, 1284-1286. [all data]
Hunter and Lias, 1998
Hunter, E.P.; Lias, S.G.,
Evaluated Gas Phase Basicities and Proton Affinities of Molecules: An Update,
J. Phys. Chem. Ref. Data, 1998, 27, 3, 413-656, https://doi.org/10.1063/1.556018
. [all data]
Hernandez, Masclet, et al., 1977
Hernandez, R.; Masclet, P.; Mouvier, G.,
Spectroscopie de photoelectrons d'aldehydes et de cetones aliphatiques,
J. Electron Spectrosc. Relat. Phenom., 1977, 10, 333. [all data]
Mouvier and Hernandez, 1975
Mouvier, G.; Hernandez, R.,
Ionisation and appearance potentials of alkylketones,
Org. Mass Spectrom., 1975, 10, 958. [all data]
Tam, Yee, et al., 1974
Tam, W.-C.; Yee, D.; Brion, C.E.,
Photoelectron spectra of some aldehydes and ketones,
J. Electron Spectrosc. Relat. Phenom., 1974, 4, 77. [all data]
Cocksey, Eland, et al., 1971
Cocksey, B.J.; Eland, J.H.D.; Danby, C.J.,
The effect of alkyl substitution on ionisation potential,
J. Chem. Soc., 1971, (B), 790. [all data]
Murad and Inghram, 1964
Murad, E.; Inghram, M.G.,
Photoionization of aliphatic ketones,
J. Chem. Phys., 1964, 40, 3263. [all data]
Watanabe, Nakayama, et al., 1962
Watanabe, K.; Nakayama, T.; Mottl, J.,
Ionization potentials of some molecules,
J. Quant. Spectry. Radiative Transfer, 1962, 2, 369. [all data]
Rogers, 1947
Rogers, M.T.,
The electric moments and ultraviolet absorption spectras of some derivatives of cyclopropane and of ethylene oxide,
J. Am. Chem. Soc., 1947, 69, 2544-2548. [all data]
Hu, Lu, et al., 2006
Hu, X.-F.; Lu, C.-H.; Yin, C.-S.,
Modeling Gas Chromatographic Retention Indices of Oxygen-containing Compounds by Novel Atom-type Topological Indices,
Chinese Journal of Chemical Physics, 2006, 19, 3, 243-247, https://doi.org/10.1360/cjcp2006.19(3).243.5
. [all data]
Héberger, Görgényi, et al., 2002
Héberger, K.; Görgényi, M.; Kowalska, T.,
Temperature dependence of Kováts indices in gas chromatography revisited,
J. Chromatogr. A, 2002, 973, 1-2, 135-142, https://doi.org/10.1016/S0021-9673(02)01198-6
. [all data]
Héberger and Görgényi, 1999
Héberger, K.; Görgényi, M.,
Principal component analysis of Kováts indices for carbonyl compounds in capillary gas chromatography,
J. Chromatogr., 1999, 845, 1-2, 21-31, https://doi.org/10.1016/S0021-9673(99)00323-4
. [all data]
Winskowski, 1983
Winskowski, J.,
Gaschromatographische Identifizierung von Stoffen anhand von Indexziffem und unterschiedlichen Detektoren,
Chromatographia, 1983, 17, 3, 160-165, https://doi.org/10.1007/BF02271041
. [all data]
Wehrli and Kováts, 1959
Wehrli, A.; Kováts, E.,
Gas-chromatographische Charakterisierung ogranischer Verbindungen. Teil 3: Berechnung der Retentionsindices aliphatischer, alicyclischer und aromatischer Verbindungen,
Helv. Chim. Acta, 1959, 7, 7, 2709-2736, https://doi.org/10.1002/hlca.19590420745
. [all data]
Ohnishi and Shibamoto, 1984
Ohnishi, S.; Shibamoto, T.,
Volatile compounds from heated beef fat and beef fat with glycine,
J. Agric. Food Chem., 1984, 32, 5, 987-992, https://doi.org/10.1021/jf00125a008
. [all data]
Censullo, Jones, et al., 2003
Censullo, A.C.; Jones, D.R.; Wills, M.T.,
Speciation of the volatile organic compounds (VOCs) in solventborne aerosol coatings by solid phase microextraction-gas chromatography,
J. Coat. Technol., 2003, 75, 936, 47-53, https://doi.org/10.1007/BF02697922
. [all data]
Kim, 2001
Kim, J.S.,
Einfluss der Temperatur beim Rösten von Sesam auf Aroma und antioxidative Eigenschaften des Öls, PhD Thesis, Technischen Universität Berlin zur Erlangung des akademischen Grades, Berlin, 2001, 151. [all data]
Owens J.D., Allagheny N., et al., 1997
Owens J.D.; Allagheny N.; Kipping G.; Ames J.M.,
Formation of volatile compounds during Bacillus subtilis fermentation of soya beans,
J. Sci. Food Agric., 1997, 74, 1, 132-140, https://doi.org/10.1002/(SICI)1097-0010(199705)74:1<132::AID-JSFA779>3.0.CO;2-8
. [all data]
Shimoda, Peralta, et al., 1996
Shimoda, M.; Peralta, R.R.; Osajima, Y.,
Headspace gas analysis of fish sauce,
J. Agric. Food Chem., 1996, 44, 11, 3601-3605, https://doi.org/10.1021/jf960345u
. [all data]
Shimoda, Shiratsuchi, et al., 1996
Shimoda, M.; Shiratsuchi, H.; Nakada, Y.; Wu, Y.; Osajima, Y.,
Identification and sensory characterization of volatile flavor compounds in sesame seed oil,
J. Agric. Food Chem., 1996, 44, 12, 3909-3912, https://doi.org/10.1021/jf960115f
. [all data]
Tanchotikul and Hsieh, 1989
Tanchotikul, U.; Hsieh, T.C.-Y.,
Volatile Flavor Components in Crayfish Waste,
J. Food Sci., 1989, 54, 6, 1515-1520, https://doi.org/10.1111/j.1365-2621.1989.tb05149.x
. [all data]
Radovic, Careri, et al., 2001
Radovic, B.S.; Careri, M.; Mangia, A.; Musci, M.; Gerboles, M.; Anklam, E.,
Analytical, nutritional, and clinical methods section. Contribution of dynamic headspace GC-MS analysis of aroma compounds to authenticity testing of honey,
Food Chem., 2001, 72, 4, 511-520, https://doi.org/10.1016/S0308-8146(00)00263-6
. [all data]
Amboni, Junkes, et al., 2002
Amboni, R.D.DeM.C.; Junkes, B. daS.; Yunes, R.A.; Heinzen, V.E.F.,
Quantitative structure-property relationships study of chromatographic retention indices and normal boiling points for oxo compounds using the semi-empirical topological method,
J. Mol. Struct. (Theochem), 2002, 586, 1-3, 71-80, https://doi.org/10.1016/S0166-1280(02)00062-3
. [all data]
Kurdina, Markovich, et al., 1969
Kurdina, Z.G.; Markovich, V.E.; Sakharov, V.M.,
Gas chromatography of cyclic O-containing compounds
in Gas chromatography, Issue # 10, NIITEKhim, Moscow, 1969, 128-133. [all data]
Zenkevich, Eliseenkov, et al., 2011
Zenkevich, I.G.; Eliseenkov, E.V.; Kasatochkin, A.N.; Zhakovskaya, Z.A.; Khoroshko, L.O.,
Gas chromatographic identification of chlorination products of aliphatic ketones,
J. Chromatogr., 2011, 1218, 21, 3291-3299, https://doi.org/10.1016/j.chroma.2010.12.056
. [all data]
Sivadier, Ratel, et al., 2009
Sivadier, G.; Ratel, J.; Engel, E.,
Latency and persistence of diet volatile biomarkers in lamb fats,
J. Agric. Food Chem., 2009, 57, 2, 645-652, https://doi.org/10.1021/jf802467q
. [all data]
Leffingwell and Alford, 2005
Leffingwell, J.C.; Alford, E.D.,
Volatile constituents of Perique tobacco,
Electron. J. Environ. Agric. Food Chem., 2005, 4, 2, 899-915. [all data]
Ngassoum, Jirovetz, et al., 2001
Ngassoum, M.B.; Jirovetz, L.; Buchbauer, G.,
SPME/GC/MS analysis of headspace aroma compounds of the Cameroonian fruit Tetrapleura tetraptera (Thonn.) Taub.,
Eur. Food Res. Technol., 2001, 213, 1, 18-21, https://doi.org/10.1007/s002170100330
. [all data]
Chen and Ho, 1999
Chen, J.; Ho, C.-T.,
Comparison of volatile generation in serine/threonine/glutamine-ribose/glucose/fructose model systems,
J. Agric. Food Chem., 1999, 47, 2, 643-647, https://doi.org/10.1021/jf980771a
. [all data]
Lu, Yu, et al., 1997
Lu, G.; Yu, T.-H.; Ho, C.-T.,
Generation of flavor compounds by the reaction of 2-deoxyglucose with selected amino acids,
J. Agric. Food Chem., 1997, 45, 1, 233-236, https://doi.org/10.1021/jf960609c
. [all data]
Larsen and Frisvad, 1995
Larsen, T.O.; Frisvad, J.C.,
Characterization of volatile metabolites from 47 Penicillium taxa,
Mycol. Res., 1995, 99, 10, 1153-1166, https://doi.org/10.1016/S0953-7562(09)80271-2
. [all data]
Misharina, Golovnya, et al., 1991
Misharina, T.A.; Golovnya, R.V.; Charnomskii, V.V.,
Volatile components of boiled shrimp funchalia woodwardi and crab geryon maritae,
Zh. Anal. Khim., 1991, 46, 1421-1429. [all data]
Habu, Flath, et al., 1985
Habu, T.; Flath, R.A.; Mon, T.R.; Morton, J.F.,
Volatile components of Rooibos tea (Aspalathus linearis),
J. Agric. Food Chem., 1985, 33, 2, 249-254, https://doi.org/10.1021/jf00062a024
. [all data]
del Rosario, de Lumen, et al., 1984
del Rosario, R.; de Lumen, B.O.; Habu, T.; Flath, R.A.; Mon, T.R.; Teranishi, R.,
Comparison of headspace volatiles from winged beans and soybeans,
J. Agric. Food Chem., 1984, 32, 5, 1011-1015, https://doi.org/10.1021/jf00125a015
. [all data]
Rotsatschakul, Visesanguan, et al., 2009
Rotsatschakul, P.; Visesanguan, W.; Smitinont, T.; Chaiseri, S.,
Changes in volatile compounds during fermentation of nham (Thai fermented sausage),
Int. Food Res. J., 2009, 16, 391-414. [all data]
Feng and Mu, 2007
Feng, H.; Mu, L.-L.,
Quantitative structure-retention relationships for alkane and its derivatives based on electrotopological state index and molecular shape index,
Chem. Ind. Engineering (Chinese), 2007, 24, 2, 161-168. [all data]
Thierry, Maillard, et al., 2005
Thierry, A.; Maillard, M.-B.; Bonnarme, P.; Roussel, E.,
The addition of Propionibacterium freudenreichii to raclette cheese induces biochemical changes and enhances flavor development,
J. Agric. Food Chem., 2005, 53, 10, 4157-4165, https://doi.org/10.1021/jf0481195
. [all data]
Junkes, Amboni, et al., 2004
Junkes, B.S.; Amboni, R.D.M.C.; Yunes, R.A.; Heinzen, V.E.F.,
Application of the semi-empirical topological index in quantitative structure-chromatographic retention relationship (QSRR) studies of aliphatic ketones and aldehydes on stationary phases of different polarity,
J. Braz. Chem. Soc., 2004, 15, 2, 183-189, https://doi.org/10.1590/S0103-50532004000200005
. [all data]
Junkes, Castanho, et al., 2003
Junkes, B.S.; Castanho, R.D.M.; Amboni, C.; Yunes, R.A.; Heinzen, V.E.F.,
Semiempirical Topological Index: A Novel Molecular Descriptor for Quantitative Structure-Retention Relationship Studies,
Internet Electronic Journal of Molecular Design, 2003, 2, 1, 33-49. [all data]
Estrada and Gutierrez, 1999
Estrada, E.; Gutierrez, Y.,
Modeling chromatographic parameters by a novel graph theoretical sub-structural approach,
J. Chromatogr. A, 1999, 858, 2, 187-199, https://doi.org/10.1016/S0021-9673(99)00808-0
. [all data]
Flanagan, Streete, et al., 1997
Flanagan, R.J.; Streete, P.J.; Ramsey, J.D.,
Volatile Substance Abuse, UNODC Technical Series, No 5, United Nations, Office on Drugs and Crime, Vienna International Centre, PO Box 500, A-1400 Vienna, Austria, 1997, 56, retrieved from http://www.odccp.org/pdf/technicalseries1997-01-011.pdf. [all data]
Zenkevich and Chupalov, 1996
Zenkevich, I.G.; Chupalov, A.A.,
New Possibilities of Chromato Mass Pectrometric Identification of Organic Compounds Using Increments of Gas Chromatographic Retention Indices of Molecular Structural Fragments,
Zh. Org. Khim. (Rus.), 1996, 32, 5, 656-666. [all data]
Ciccioli, Cecinato, et al., 1994
Ciccioli, P.; Cecinato, A.; Brancaleoni, E.; Brachetti, A.; Frattoni, M.; Sparapani, R.,
Composition and Distribution of Polar and Non-Polar VOCs in Urban, Rural, Forest and Remote Areas,
Eur Commission EUR, 1994, 549-568. [all data]
Ciccioli, Brancaleoni, et al., 1993
Ciccioli, P.; Brancaleoni, E.; Cecinato, A.; Sparapani, R.; Frattoni, M.,
Identification and determination of biogenic and anthropogenic volatile organic compounds in forest areas of Northern and Southern Europe and a remote site of the Himalaya region by high-resolution gas chromatography-mass spectrometry,
J. Chromatogr., 1993, 643, 1-2, 55-69, https://doi.org/10.1016/0021-9673(93)80541-F
. [all data]
Strete, Ruprah, et al., 1992
Strete, P.J.; Ruprah, M.; Ramsey, J.D.; Flanagan, R.J.,
Detection and identification of volatile substances by headspace capillary gas chromatography to aid the diagnosis of acute poisoning,
Analyst, 1992, 117, 7, 1111-1127, https://doi.org/10.1039/an9921701111
. [all data]
P'yanova, Zvereva, et al., 1987
P'yanova, V.P.; Zvereva, M.N.; Tsypysheva, LG.; Portnova, T.V.; Kruglov, E.A.,
Investigating the products of thiophane synthesis, Abstr. IX All-Union Conference on Gas Chromatography, Kuibyshev State University, Kuibyshev, 1987, 308. [all data]
Waggott and Davies, 1984
Waggott, A.; Davies, I.W.,
Identification of organic pollutants using linear temperature programmed retention indices (LTPRIs) - Part II, 1984, retrieved from http://dwi.defra.gov.uk/research/completed-research/reports/dwi0383.pdf. [all data]
Ramsey and Flanagan, 1982
Ramsey, J.D.; Flanagan, R.J.,
Detection and Identification of Volatile Organic Compounds in Blood by Headspace Gas Chromatography as an Aid to the Diagnosis of Solvent Abuse,
J. Chromatogr., 1982, 240, 2, 423-444, https://doi.org/10.1016/S0021-9673(00)99622-5
. [all data]
Choi, 2004
Choi, H.-S.,
Aroma evaluation of an aquatic herb, changpo (Acorus calamus Var. angustatus Bess), by AEDA and SPME,
J. Agric. Food Chem., 2004, 52, 26, 8099-8104, https://doi.org/10.1021/jf040239p
. [all data]
Tanaka, Yamauchi, et al., 2003
Tanaka, T.; Yamauchi, T.; Katsumata, R.; Kiuchi, K.,
Comparison of volatile components in commercial Itohiki-Natto by solid phase microextraction and gas chromatography,
Nippon Shokuhin Kagaku Kogaku Kaishi, 2003, 50, 6, 278-285, https://doi.org/10.3136/nskkk.50.278
. [all data]
Girard and Durance, 2000
Girard, B.; Durance, T.,
Headspace volatiles of sockeye and pink salmon as affected by retort process,
Food Chem. Toxicol., 2000, 65, 1, 34-39. [all data]
Hwan and Chou, 1999
Hwan, C.-H.; Chou, C.-C.,
Volatile components of the Chinese fermented soya bean curd as affected by the addition of ethanol in ageing solution,
J. Sci. Food Agric., 1999, 79, 2, 243-248, https://doi.org/10.1002/(SICI)1097-0010(199902)79:2<243::AID-JSFA179>3.0.CO;2-I
. [all data]
Johanningsmeier and McFeeters, 2011
Johanningsmeier, S.D.; McFeeters, R.F.,
Detection of volatile spoilage metabolites in fermented cucumbers using nontargeted, comprehensive 2-dimensional gas chromatography-time-of-flight mass spectrometry (GCxGCxTOFMS),
J. Food Sci., 2011, 76, 1, c168-c177, https://doi.org/10.1111/j.1750-3841.2010.01918.x
. [all data]
Gyawalia, Seo, et al., 2006
Gyawalia, R.; Seo, H.-Y.; Lee, H.-J.; Song, H.-P.; Kim, D.-H.; Byun, M.-W.; Kim, K.-S.,
Effect of γ-irradiation on volatile compounds of dried Welsh onion (Allium fistulosum L.),
Radiat. Phys. Chem., 2006, 75, 2, 322-328, https://doi.org/10.1016/j.radphyschem.2005.07.001
. [all data]