1-Butene, 2,3-dimethyl-
- Formula: C6H12
- Molecular weight: 84.1595
- IUPAC Standard InChIKey: OWWIWYDDISJUMY-UHFFFAOYSA-N
- CAS Registry Number: 563-78-0
- Chemical structure:
View 3d structure (requires JavaScript / HTML 5) - Species with the same structure:
- Other names: 2,3-Dimethyl-1-butene; (CH3)2CHC(CH3)=CH2; 2,3-Dimethylbutene-1; 2,3-dimethylbut-1-ene

Gas phase thermochemistry data

Data compiled by: Hussein Y. Afeefy, Joel F. Liebman, and Stephen E. Stein
Quantity | Value | Units | Method | Reference | Comment |
---|---|---|---|---|---|
ΔfH°gas | -65.9 ± 1.5 | kJ/mol | Ccb | Wiberg and Hao, 1991 | |
ΔfH°gas | -61. ± 2. | kJ/mol | Eqk | Rodgers and Wu, 1971 | Heat of isomerization |

Condensed phase thermochemistry data

Data compiled by: Hussein Y. Afeefy, Joel F. Liebman, and Stephen E. Stein
Quantity | Value | Units | Method | Reference | Comment |
---|---|---|---|---|---|
ΔfH°liquid | -95.1 ± 1.5 | kJ/mol | Ccb | Wiberg and Hao, 1991 |

Phase change data

Data compiled as indicated in comments:
BS - Robert L. Brown and Stephen E. Stein
TRC - Thermodynamics Research Center, NIST Boulder Laboratories, Chris Muzny director
AC - William E. Acree, Jr., James S. Chickos
ALS - Hussein Y. Afeefy, Joel F. Liebman, and Stephen E. Stein
Quantity | Value | Units | Method | Reference | Comment |
---|---|---|---|---|---|
Tboil | 329.0 ± 0.6 | K | AVG | N/A | Average of 19 values; Individual data points |
Quantity | Value | Units | Method | Reference | Comment |
Tfus | 120. ± 20. | K | AVG | N/A | Average of 8 values; Individual data points |
Quantity | Value | Units | Method | Reference | Comment |
ΔvapH° | 29.2 | kJ/mol | N/A | Reid, 1972 | AC |
ΔvapH° | 29.2 | kJ/mol | V | Camin and Rossini, 1956 | ALS |
ΔvapH° | 29.2 | kJ/mol | N/A | Camin and Rossini, 1956, 2 | Based on data from 289. to 329. K.; AC |
Enthalpy of vaporization
ΔvapH (kJ/mol) | Temperature (K) | Method | Reference | Comment |
---|---|---|---|---|
30.5 | 282. | A | Stephenson and Malanowski, 1987 | Based on data from 267. to 335. K.; AC |

Reaction thermochemistry data

Data compiled by: Hussein Y. Afeefy, Joel F. Liebman, and Stephen E. Stein
Individual Reactions
By formula: C6H12 = C6H12
Quantity | Value | Units | Method | Reference | Comment |
---|---|---|---|---|---|
ΔrH° | 7.61 ± 0.50 | kJ/mol | Eqk | Radyuk, Kabo, et al., 1972 | gas phase; At 562 K |
ΔrH° | 7.1 ± 0.8 | kJ/mol | Eqk | Rodgers and Wu, 1971 | gas phase; Heat of isomerization |
By formula: H2 + C6H12 = C6H14
Quantity | Value | Units | Method | Reference | Comment |
---|---|---|---|---|---|
ΔrH° | -116.3 ± 0.58 | kJ/mol | Chyd | Rogers, Crooks, et al., 1987 | liquid phase |
ΔrH° | -116.1 ± 0.4 | kJ/mol | Chyd | Kistiakowsky, Ruhoff, et al., 1936 | gas phase |
By formula: C6H12 = C6H12
Quantity | Value | Units | Method | Reference | Comment |
---|---|---|---|---|---|
ΔrH° | -7.1 ± 0.8 | kJ/mol | Eqk | Rodgers and Wu, 1971 | gas phase; Heat of isomerization |
ΔrH° | -7.5 | kJ/mol | Eqk | Abell, 1966 | gas phase |
By formula: C6H12 + HCl = C6H13Cl
Quantity | Value | Units | Method | Reference | Comment |
---|---|---|---|---|---|
ΔrH° | -62.2 ± 1.7 | kJ/mol | Cm | Arnett and Pienta, 1980 | liquid phase; solvent: Methylene chloride; Hydrochlorination |
By formula: C6H12 = C6H12
Quantity | Value | Units | Method | Reference | Comment |
---|---|---|---|---|---|
ΔrH° | -23.2 ± 1.4 | kJ/mol | Ciso | Bartolo and Rossini, 1960 | liquid phase; Calculated from ΔHc |

Gas phase ion energetics data

Data evaluated as indicated in comments:
L - Sharon G. Lias
Data compiled as indicated in comments:
LLK - Sharon G. Lias, Rhoda D. Levin, and Sherif A. Kafafi
Quantity | Value | Units | Method | Reference | Comment |
---|---|---|---|---|---|
IE (evaluated) | 9.07 ± 0.01 | eV | N/A | N/A | L |
Ionization energy determinations
IE (eV) | Method | Reference | Comment |
---|---|---|---|
9.07 ± 0.02 | PE | Bieri, Burger, et al., 1977 | LLK |
9.072 ± 0.005 | PE | Masclet, Grosjean, et al., 1973 | LLK |
8.41 | PE | Bock and Kaim, 1980 | Vertical value; LLK |

Kovats' RI, non-polar column, isothermal

Column type | Active phase | Temperature (C) | I | Reference | Comment |
---|---|---|---|---|---|
Capillary | Methyl Silicone | 30. | 566.1 | Soják, Addová, et al., 2002 | He; Column length: 150. m; Column diameter: 0.250 mm |
Capillary | Squalane | 30. | 557.6 | Soják, Addová, et al., 2002 | He; Column length: 93. m; Column diameter: 0.250 mm |
Capillary | Squalane | 25. | 557. | Hilal, Carreira, et al., 1994 | |
Capillary | OV-101 | 40. | 566. | Laub and Purnell, 1988 | |
Capillary | OV-101 | 60. | 566. | Laub and Purnell, 1988 | |
Capillary | OV-101 | 80. | 567. | Laub and Purnell, 1988 | |
Capillary | Squalane | 50. | 555.9 | Papazova, Milina, et al., 1988 | Column length: 50. m; Column diameter: 0.25 mm |
Capillary | OV-101 | 50. | 565.8 | Boneva and Dimov, 1986 | 100. m/0.27 mm/0.9 μm, N2 |
Capillary | OV-101 | 70. | 566.3 | Boneva and Dimov, 1986 | 100. m/0.27 mm/0.9 μm, N2 |
Capillary | Squalane | 50. | 558.8 | Boneva and Dimov, 1986 | N2; Column length: 100. m; Column diameter: 0.25 mm |
Capillary | Squalane | 70. | 559.6 | Boneva and Dimov, 1986 | N2; Column length: 100. m; Column diameter: 0.25 mm |
Capillary | DB-1 | 40. | 566. | Lubeck and Sutton, 1984 | 60. m/0.264 mm/0.25 μm, H2 |
Capillary | HP-PONA | 40. | 566. | Lubeck and Sutton, 1984 | 50. m/0.21 mm/0.5 μm, H2 |
Capillary | Squalane | 50. | 558.4 | Bajus, Veselý, et al., 1979 | Column length: 100. m; Column diameter: 0.25 mm |
Capillary | Squalane | 70. | 559.4 | Bajus, Veselý, et al., 1979 | Column length: 100. m; Column diameter: 0.25 mm |
Packed | Squalane | 80. | 560. | Chrétien and Dubois, 1977 | |
Capillary | Squalane | 50. | 559. | Chretien and Dubois, 1976 | |
Capillary | Squalane | 100. | 560.7 | Lulova, Leont'eva, et al., 1976 | He; Column length: 120. m; Column diameter: 0.25 mm |
Capillary | Squalane | 50. | 559. | Rijks and Cramers, 1974 | N2; Column length: 100. m; Column diameter: 0.25 mm |
Capillary | Squalane | 70. | 560. | Rijks and Cramers, 1974 | N2; Column length: 100. m; Column diameter: 0.25 mm |
Capillary | Squalane | 27. | 557.39 | Schomburg and Dielmann, 1973 | Column length: 100. m; Column diameter: 0.25 mm |
Capillary | Squalane | 40. | 559. | Matukuma, 1969 | N2; Column length: 91.4 m; Column diameter: 0.25 mm |
Packed | Squalane | 27. | 558. | Hively and Hinton, 1968 | He, Chromosorb P; Column length: 15. m; Column diameter: 0.25 mm |
Packed | Squalane | 49. | 558. | Hively and Hinton, 1968 | He, Chromosorb P; Column length: 15. m; Column diameter: 0.25 mm |
Packed | Squalane | 67. | 561. | Hively and Hinton, 1968 | He, Chromosorb P; Column length: 15. m; Column diameter: 0.25 mm |
Packed | Squalane | 26. | 559. | Zulaïca and Guiochon, 1966 | Column length: 10. m |

Kovats' RI, non-polar column, custom temperature program

Column type | Active phase | I | Reference | Comment |
---|---|---|---|---|
Capillary | Petrocol DH-100 | 572.5 | Haagen-Smit Laboratory, 1997 | He; Column length: 100. m; Column diameter: 0.2 mm; Program: 5C(10min) => 5C/min => 50C(48min) => 1.5C/min => 195C(91min) |
Capillary | DB-1 | 569. | Hoekman, 1993 | 60. m/0.32 mm/1.0 μm, He; Program: -40 C for 12 min; -40 - 125 C at 3 deg.min; 125-185 C at 6 deg/min; 185 - 220 C at 20 deg/min; hold 220 C for 2 min |

Van Den Dool and Kratz RI, non-polar column, temperature ramp

Column type | Active phase | I | Reference | Comment |
---|---|---|---|---|
Capillary | Methyl Silicone | 564.9 | Soják, Addová, et al., 2002 | He, 1. K/min; Column length: 150. m; Column diameter: 0.250 mm; Tstart: 30. C; Tend: 200. C |
Capillary | Petrocol DH | 557. | White, Hackett, et al., 1992 | 100. m/0.25 mm/0.5 μm, He, 1. K/min; Tstart: 30. C; Tend: 220. C |

Normal alkane RI, non-polar column, isothermal

Column type | Active phase | Temperature (C) | I | Reference | Comment |
---|---|---|---|---|---|
Capillary | Squalane | 40. | 558.3 | Sojak, Addova, et al., 2000 | He; Column length: 93. m; Column diameter: 0.25 mm |
Capillary | Methyl Silicone | 50. | 554. | N/A | N2; Column length: 74.6 m; Column diameter: 0.28 mm |
Capillary | Squalane | 70. | 558. | Schomburg, 1966 |

Normal alkane RI, non-polar column, temperature ramp

Column type | Active phase | I | Reference | Comment |
---|---|---|---|---|
Capillary | Polydimethyl siloxane: CP-Sil 5 CB | 564. | Bramston-Cook, 2013 | 60. m/0.25 mm/1.0 μm, Helium, 45. C @ 1.45 min, 3.6 K/min, 210. C @ 2.72 min |
Capillary | Petrocol DH | 568. | Supelco, 2012 | 100. m/0.25 mm/0.50 μm, Helium, 20. C @ 15. min, 15. K/min, 220. C @ 30. min |
Capillary | OV-101 | 564. | Orav, Kailas, et al., 1999 | 50. m/0.20 mm/0.50 μm, Helium, 30. C @ 6. min, 1. K/min; Tend: 100. C |
Capillary | SE-54 | 548. | Guan, Li, et al., 1995 | 60. C @ 2. min, 4. K/min; Column length: 50. m; Column diameter: 0.32 mm; Tend: 200. C |
Capillary | DB-1 | 564. | Ramnas, Ostermark, et al., 1994 | 50. m/0.32 mm/1.0 μm, He, 2. K/min; Tstart: -20. C |
Capillary | OV-101 | 566. | Mandelshtam, Kharicheva, et al., 1991 | Helium, 50. C @ 0. min, 3. K/min, 220. C @ 0. min; Column length: 54. m; Column diameter: 0.26 mm |

Normal alkane RI, non-polar column, custom temperature program

Column type | Active phase | I | Reference | Comment |
---|---|---|---|---|
Capillary | Polydimethyl siloxane | 560. | Junkes, Castanho, et al., 2003 | Program: not specified |
Capillary | DB-1 | 566. | Zhu and Wang, 2001 | Program: not specified |
Capillary | Methyl Silicone | 570. | Spieksma, 1999 | Program: not specified |
Packed | SE-30 | 571. | Robinson and Odell, 1971 | N2, Chromosorb W; Column length: 6.1 m; Program: 50C910min) => 20C/min => 90(6min) => 10C/min => 150C(hold) |
Packed | Squalane | 562. | Robinson and Odell, 1971 | N2, Embacel; Column length: 3.0 m; Program: 25C(5min) => 2C/min => 35 => 4C/min => 95C(hold) |

References

Wiberg and Hao, 1991
Wiberg, K.B.; Hao, S.,
Enthalpies of hydration of alkenes. 4. Formation of acyclic tert-alcohols,
J. Org. Chem., 1991, 56, 5108-5110. [all data]
Rodgers and Wu, 1971
Rodgers, A.S.; Wu, M.-C.R.,
Thermochemistry of the gas-phase iodine catalyzed isomerization: 2,3-dimethyl-1-butene = 2,3-dimethyl-2-butene,
J. Chem. Thermodyn., 1971, 3, 591-597. [all data]
Reid, 1972
Reid, Robert C.,
Handbook on vapor pressure and heats of vaporization of hydrocarbons and related compounds, R. C. Wilhort and B. J. Zwolinski, Texas A Research Foundation. College Station, Texas(1971). 329 pages.$10.00,
AIChE J., 1972, 18, 6, 1278-1278, https://doi.org/10.1002/aic.690180637
. [all data]
Camin and Rossini, 1956
Camin, D.L.; Rossini, F.D.,
Physical properties of the 17 isomeric hexenes of the API research series,
J. Phys. Chem., 1956, 60, 1446. [all data]
Camin and Rossini, 1956, 2
Camin, David L.; Rossini, Frederick D.,
Physical Properties of the 17 Isomeric Hexenes.of the API Research Series,
J. Phys. Chem., 1956, 60, 10, 1446-1451, https://doi.org/10.1021/j150544a029
. [all data]
Stephenson and Malanowski, 1987
Stephenson, Richard M.; Malanowski, Stanislaw,
Handbook of the Thermodynamics of Organic Compounds, 1987, https://doi.org/10.1007/978-94-009-3173-2
. [all data]
Radyuk, Kabo, et al., 1972
Radyuk, Z.A.; Kabo, G.Ya.; Andreevskii, D.N.,
Equilibrium and thermodynamics of the isomerization of hexene isomers,
Neftekhimiya, 1972, 12, 679-686. [all data]
Rogers, Crooks, et al., 1987
Rogers, D.W.; Crooks, E.; Dejroongruang, K.,
Enthalpies of hydrogenation of the hexenes,
J. Chem. Thermodyn., 1987, 19, 1209-1215. [all data]
Kistiakowsky, Ruhoff, et al., 1936
Kistiakowsky, G.B.; Ruhoff, J.R.; Smith, H.A.; Vaughan, W.E.,
Heats of organic reactions. III. Hydrogenation of some higher olefins,
J. Am. Chem. Soc., 1936, 58, 137-145. [all data]
Abell, 1966
Abell, P.I.,
Bromine atom catalyzed isomerization of terminal olefins,
J. Am. Chem. Soc., 1966, 88, 1346-1348. [all data]
Arnett and Pienta, 1980
Arnett, E.M.; Pienta, N.J.,
Stabilities of carbonium ions in solution. 12. Heats of formation of alkyl chlorides as an entree to heats of solvation of aliphatic carbonium ions,
J. Am. Chem. Soc., 1980, 102, 3329-3334. [all data]
Bartolo and Rossini, 1960
Bartolo, H.F.; Rossini, F.D.,
Heats of isomerization of the seventeen isomeric hexenes,
J. Phys. Chem., 1960, 64, 1685-1689. [all data]
Bieri, Burger, et al., 1977
Bieri, G.; Burger, F.; Heilbronner, E.; Maier, J.P.,
Valence ionization enrgies of hydrocarbons,
Helv. Chim. Acta, 1977, 60, 2213. [all data]
Masclet, Grosjean, et al., 1973
Masclet, P.; Grosjean, D.; Mouvier, G.,
Alkene ionization potentials. Part I. Quantitative determination of alkyl group structural effects,
J. Electron Spectrosc. Relat. Phenom., 1973, 2, 225. [all data]
Bock and Kaim, 1980
Bock, H.; Kaim, W.,
Radical ions. 37. Ionization and one-electron oxidation of electron-rich silylalkyl olefins,
J. Am. Chem. Soc., 1980, 102, 4429. [all data]
Heathcock and Poulter, 1968
Heathcock, C.H.; Poulter, S.R.,
The effect of cyclopropyl substitution on the π → π* transition of simple olefins,
J. Am. Chem. Soc., 1968, 90, 14, 3767-3769. [all data]
Soják, Addová, et al., 2002
Soják, L.; Addová, G.; Kubinec, R.; Kraus, A.; Hu, G.,
Gas chromatographic-mass spectrometric characterization of all acyclic C5-C7 alkenes from fluid catalytic cracked gasoline using polydimethylsiloxane and squalane stationary phases,
J. Chromatogr. A, 2002, 947, 1, 103-117, https://doi.org/10.1016/S0021-9673(01)01564-3
. [all data]
Hilal, Carreira, et al., 1994
Hilal, S.H.; Carreira, L.A.; Karickhoff, S.W.; Melton, C.M.,
Estimation of Gas-Liquid Chromatographic Retention Times from Molecular Structure,
J. Chromatogr. A, 1994, 662, 2, 269-280, https://doi.org/10.1016/0021-9673(94)80515-6
. [all data]
Laub and Purnell, 1988
Laub, R.J.; Purnell, J.H.,
Specific retention volumes, retention indices, and family-plot regressions of aliphatic, alicyclic, and aromatic hydrocarbon solutes with OV-101 poly (dimethylsiloxane) stationary phase,
J. Hi. Res. Chromatogr. Chromatogr. Comm., 1988, 11, 9, 649-660, https://doi.org/10.1002/jhrc.1240110908
. [all data]
Papazova, Milina, et al., 1988
Papazova, D.; Milina, R.; Dimov, N.,
Comparative evaluation of retention of hydrocarbons present in the C5-petroleum fraction of methylsilicone and squalane phases,
Chromatographia, 1988, 25, 3, 177-180, https://doi.org/10.1007/BF02316441
. [all data]
Boneva and Dimov, 1986
Boneva, S.; Dimov, N.,
Gas Chromatographic Retention Indices for Alkenes on OV-101 and Squalane Capillary Columns,
Chromatographia, 1986, 21, 3, 149-151, https://doi.org/10.1007/BF02311743
. [all data]
Lubeck and Sutton, 1984
Lubeck, A.J.; Sutton, D.L.,
Kovats Retention Indices of Selected Olefins on Bonded Phase Fused Silica Capillaries,
J. Hi. Res. Chromatogr. Chromatogr. Comm., 1984, 7, 9, 542-544, https://doi.org/10.1002/jhrc.1240070913
. [all data]
Bajus, Veselý, et al., 1979
Bajus, M.; Veselý, V.; Leclercq, P.A.; Rijks, J.A.,
Steam cracking of hydrocarbons. 2. Pyrolysis of methylcyclohexane,
Ind. Eng. Chem. Prod. Res. Dev., 1979, 18, 2, 135-142, https://doi.org/10.1021/i360070a012
. [all data]
Chrétien and Dubois, 1977
Chrétien, J.R.; Dubois, J.E.,
Topological analysis of gas-liquid chromatographic behavior of alkenes,
Anal. Chem., 1977, 49, 6, 747-756, https://doi.org/10.1021/ac50014a021
. [all data]
Chretien and Dubois, 1976
Chretien, J.R.; Dubois, J.-E.,
New Perspectives in the Prediction of Kovats Indices,
J. Chromatogr., 1976, 126, 171-189, https://doi.org/10.1016/S0021-9673(01)84071-1
. [all data]
Lulova, Leont'eva, et al., 1976
Lulova, N.I.; Leont'eva, S.A.; Timofeeva, A.N.,
Gas-chromatographic method of determination of individual hydrocarbons in catalytic cracking gasolines
in Proceedings of All-Union Research Institute on Oil Processes. Vol.18, All-Union Research Institute on Oil Processes, Moscow, 1976, 30-53. [all data]
Rijks and Cramers, 1974
Rijks, J.A.; Cramers, C.A.,
High precision capillary gas chromatography of hydrocarbons,
Chromatographia, 1974, 7, 3, 99-106, https://doi.org/10.1007/BF02269819
. [all data]
Schomburg and Dielmann, 1973
Schomburg, G.; Dielmann, G.,
Identification by means of retention parameters,
J. Chromatogr. Sci., 1973, 11, 3, 151-159, https://doi.org/10.1093/chromsci/11.3.151
. [all data]
Matukuma, 1969
Matukuma, A.,
Retention indices of alkanes through C10 and alkenes through C8 and relation between boiling points and retention data,
Gas Chromatogr., Int. Symp. Anal. Instrum. Div Instrum Soc. Amer., 1969, 7, 55-75. [all data]
Hively and Hinton, 1968
Hively, R.A.; Hinton, R.E.,
Variation of the retention index with temperature on squalane substrates,
J. Gas Chromatogr., 1968, 6, 4, 203-217, https://doi.org/10.1093/chromsci/6.4.203
. [all data]
Zulaïca and Guiochon, 1966
Zulaïca, J.; Guiochon, G.,
Analyse des hauts polymères par chromatographie en phase gazeuse de leurs produits de pyrolyse. II. Application à quelques hydrocarbures macromoléculaires purs,
Bull. Soc. Chim. Fr., 1966, 4, 1351-1363. [all data]
Haagen-Smit Laboratory, 1997
Haagen-Smit Laboratory,
Procedure for the detailed hydrocarbon analysis of gasolines by single column high efficiency (capillary) column gas chromatography, SOP NO. MLD 118, Revision No. 1.1, California Environmental Protection Agency, Air Resources Board, El Monte, California, 1997, 22. [all data]
Hoekman, 1993
Hoekman, S.K.,
Improved gas chromatography procedure for speciated hydrocarbon measurements of vehicle emissions,
J. Chromatogr., 1993, 639, 2, 239-253, https://doi.org/10.1016/0021-9673(93)80260-F
. [all data]
White, Hackett, et al., 1992
White, C.M.; Hackett, J.; Anderson, R.R.; Kail, S.; Spock, P.S.,
Linear temperature programmed retention indices of gasoline range hydrocarbons and chlorinated hydrocarbons on cross-linked polydimethylsiloxane,
J. Hi. Res. Chromatogr., 1992, 15, 2, 105-120, https://doi.org/10.1002/jhrc.1240150211
. [all data]
Sojak, Addova, et al., 2000
Sojak, L.; Addova, G.; Kubinec, R.; Ruman, J.; Hu, G.,
GC-MS characterization of all acyclic C5-C7 alkenes from FCC gasoline using squalane stationary phase,
Petroleum and Coal, 2000, 42, 3-4, 188-194. [all data]
Schomburg, 1966
Schomburg, G.,
Gaschromatographische Retentionsdaten und Struktur Chemischer Verbindungen. II. Methylverzweigungen und Doppelbindungen in Offenkettigen Kohlenwasserstoffen,
J. Chromatogr., 1966, 23, 1-17, https://doi.org/10.1016/S0021-9673(01)98652-2
. [all data]
Bramston-Cook, 2013
Bramston-Cook, R.,
Kovats indices for C2-C13 hydrocarbons and selected oxygenated/halocarbons with 100 % dimethylpolysiloxane columns, 2013, retrieved from http://lotusinstruments.com/monographs/List .... [all data]
Supelco, 2012
Supelco, CatalogNo. 24160-U,
Petrocol DH Columns. Catalog No. 24160-U, 2012, retrieved from http://www.sigmaaldrich.com/etc/medialib/docs/Supelco/Datasheet/1/w97949.Par.0001.File.tmp/w97949.pdf. [all data]
Orav, Kailas, et al., 1999
Orav, A.; Kailas, T.; Muurisepp, M.; Kann, J.,
Composition of the oil from waste tires. 1. Fraction boiling at yp to 160 0C,
Proc. Estonian Acad. Sci. Chem., 1999, 48, 1, 30-39. [all data]
Guan, Li, et al., 1995
Guan, Y.; Li, L.; Zhou, L.,
Live retention database for compound identification in capillary gas chromatography,
Chin. J. Chromatogr., 1995, 13, 5, 851-857. [all data]
Ramnas, Ostermark, et al., 1994
Ramnas, O.; Ostermark, U.; Peterson, G.,
Characterization of sixty alkenes in a cat-cracked gasoline naphtha by gas chromatography,
Chromatographia, 1994, 38, 3/4, 222-226, https://doi.org/10.1007/BF02290340
. [all data]
Mandelshtam, Kharicheva, et al., 1991
Mandelshtam, T.V.; Kharicheva, E.M.; Gorobets, I.A.; Zenkevich, I.G.; Kostikov, R.R.; Porokhovnikova, E.B.,
Synthesis and Chromato Mass Spectrometric Investigation of alpha-Alkoxystyrenes,
Zh. Org. Khim. (Rus.), 1991, 27, 4, 684-690. [all data]
Junkes, Castanho, et al., 2003
Junkes, B.S.; Castanho, R.D.M.; Amboni, C.; Yunes, R.A.; Heinzen, V.E.F.,
Semiempirical Topological Index: A Novel Molecular Descriptor for Quantitative Structure-Retention Relationship Studies,
Internet Electronic Journal of Molecular Design, 2003, 2, 1, 33-49. [all data]
Zhu and Wang, 2001
Zhu, X.; Wang, W.,
The relationship between partition coefficients of hydrocarbons and their retention indices,
Acta Scientific Circumstantiae, 2001, 21, 5, 631-633. [all data]
Spieksma, 1999
Spieksma, W.,
Determination of vapor liquid equilibrium from the Kovats retention index on dimethylsilicone using the Wilson mixing tool,
J. Hi. Res. Chromatogr., 1999, 22, 10, 565-588, https://doi.org/10.1002/(SICI)1521-4168(19991001)22:10<565::AID-JHRC565>3.0.CO;2-2
. [all data]
Robinson and Odell, 1971
Robinson, P.G.; Odell, A.L.,
A system of standard retention indices and its uses. The characterisation of stationary phases and the prediction of retention indices,
J. Chromatogr., 1971, 57, 1-10, https://doi.org/10.1016/0021-9673(71)80001-8
. [all data]