Ethanamine, N,N-diethyl-, compound with bromine(1:1)
- Formula: C6H15Br2N
- Molecular weight: 260.998
- IUPAC Standard InChIKey: FCARCFWLOXDWFM-UHFFFAOYSA-N
- CAS Registry Number: 56348-00-6
- Chemical structure:
View 3d structure (requires JavaScript / HTML 5) - Permanent link for this species. Use this link for bookmarking this species for future reference.

Gas phase ion energetics data

Data compiled by: Sharon G. Lias, Rhoda D. Levin, and Sherif A. Kafafi
Ionization energy determinations
IE (eV) | Method | Reference | Comment |
---|---|---|---|
10.60 | PE | Utsunomiya, Kobayashi, et al., 1976 | Vertical value |

References

Utsunomiya, Kobayashi, et al., 1976
Utsunomiya, C.; Kobayashi, T.; Nagakura, S.,
Photoelectron spectra of electron donor-acceptor complexes between bromine and alkylamines,
Chem. Phys. Lett., 1976, 39, 245. [all data]