2-Azabicyclo[3.2.1]oct-6-ene-2-carboxylic acid methyl ester
- Formula: C9H13NO2
- Molecular weight: 167.2050
- IUPAC Standard InChIKey: KRCSVZCPTHLYGS-UHFFFAOYSA-N
- CAS Registry Number: 56125-95-2
- Chemical structure:
View 3d structure (requires JavaScript / HTML 5) - Permanent link for this species. Use this link for bookmarking this species for future reference.

Gas phase ion energetics data

Data compiled by: Sharon G. Lias, Rhoda D. Levin, and Sherif A. Kafafi
Ionization energy determinations
IE (eV) | Method | Reference | Comment |
---|---|---|---|
8.60 | PE | Barraclough, Bilgic, et al., 1979 | Vertical value |

References

Barraclough, Bilgic, et al., 1979
Barraclough, P.; Bilgic, S.; Pedley, J.B.; Rogers, A.J.; Young, D.W.,
Conjugative and homoconjugative effects in 2-heterobicyclo[3.2.1]octa-3,6-dienes,
Tetrahedron, 1979, 35, 99. [all data]