2-Azabicyclo[3.2.1]octa-3,6-diene-2-carboxylic acid methyl ester
- Formula: C9H11NO2
- Molecular weight: 165.1891
- IUPAC Standard InChIKey: NTOQKCHMWUYMOV-UHFFFAOYSA-N
- CAS Registry Number: 56125-93-0
- Chemical structure:
View 3d structure (requires JavaScript / HTML 5) - Permanent link for this species. Use this link for bookmarking this species for future reference.

Gas phase ion energetics data

Data compiled by: Sharon G. Lias, Rhoda D. Levin, and Sherif A. Kafafi
Ionization energy determinations
IE (eV) | Method | Reference | Comment |
---|---|---|---|
8.20 | PE | Barraclough, Bilgic, et al., 1979 | Vertical value |

References

Barraclough, Bilgic, et al., 1979
Barraclough, P.; Bilgic, S.; Pedley, J.B.; Rogers, A.J.; Young, D.W.,
Conjugative and homoconjugative effects in 2-heterobicyclo[3.2.1]octa-3,6-dienes,
Tetrahedron, 1979, 35, 99. [all data]