Isobutylene epoxide
- Formula: C4H8O
- Molecular weight: 72.1057
- IUPAC Standard InChIKey: GELKGHVAFRCJNA-UHFFFAOYSA-N
- CAS Registry Number: 558-30-5
- Chemical structure:

Phase change data

Data compiled as indicated in comments:
BS - Robert L. Brown and Stephen E. Stein
TRC - Thermodynamics Research Center, NIST Boulder Laboratories, Chris Muzny director
AC - William E. Acree, Jr., James S. Chickos
Quantity | Value | Units | Method | Reference | Comment |
---|---|---|---|---|---|
Tboil | 328. ± 20. | K | AVG | N/A | Average of 6 values; Individual data points |
Quantity | Value | Units | Method | Reference | Comment |
Tfus | 207. | K | N/A | Anonymous, 1954 | Uncertainty assigned by TRC = 0.6 K; TRC |
Enthalpy of vaporization
ΔvapH (kJ/mol) | Temperature (K) | Method | Reference | Comment |
---|---|---|---|---|
30.6 | 219. | A | Stephenson and Malanowski, 1987 | Based on data from 204. to 329. K. See also Stull, 1947.; AC |
Antoine Equation Parameters
log10(P) = A − (B / (T + C))
P = vapor pressure (bar)
T = temperature (K)
View plot Requires a JavaScript / HTML 5 canvas capable browser.
Temperature (K) | A | B | C | Reference | Comment |
---|---|---|---|---|---|
204. to 328.7 | 3.75134 | 1075.484 | -41.77 | Stull, 1947 | Coefficents calculated by NIST from author's data. |

Reaction thermochemistry data

Data compiled by: Hussein Y. Afeefy, Joel F. Liebman, and Stephen E. Stein
Individual Reactions
By formula: C4H8O = C4H8O
Quantity | Value | Units | Method | Reference | Comment |
---|---|---|---|---|---|
ΔrH° | -17.03 | kJ/mol | Kin | Farberov, Bondarenko, et al., 1984 | liquid phase |
By formula: C4H8O = C4H8O
Quantity | Value | Units | Method | Reference | Comment |
---|---|---|---|---|---|
ΔrH° | -86.19 | kJ/mol | Kin | Farberov, Bondarenko, et al., 1984 | liquid phase |

Gas phase ion energetics data

Data compiled as indicated in comments:
LLK - Sharon G. Lias, Rhoda D. Levin, and Sherif A. Kafafi
Ionization energy determinations
IE (eV) | Method | Reference | Comment |
---|---|---|---|
10.00 | PE | McAlduff and Houk, 1977 | LLK |
10.00 | PE | McAlduff and Houk, 1977 | Vertical value; LLK |

Kovats' RI, non-polar column, isothermal

Data compiled by: NIST Mass Spectrometry Data Center, William E. Wallace, director

Column type CapillaryCapillaryCapillaryPackedPacked
Active phase OV-101OV-101OV-101Apiezon LApiezon L
Column length (m) 100.100.100.
Carrier gas
Substrate    Celite 545Celite 545
Column diameter (mm) 0.270.270.27
Phase thickness (μm) 0.90.90.9
Temperature (C) 70.80.90.120.160.
I 534.4534.7535.0507.510.
ReferenceBoneva and Dimov, 1987Boneva and Dimov, 1987Boneva and Dimov, 1987Bogoslovsky, Anvaer, et al., 1978Bogoslovsky, Anvaer, et al., 1978
Comment MSDC-RI MSDC-RI MSDC-RI MSDC-RI MSDC-RI

References

Anonymous, 1954
Anonymous, R.,
, Am. Pet. Inst. Res. Proj. 45, Tech. Rep. 13, Ohio State Univ., 1954. [all data]
Stephenson and Malanowski, 1987
Stephenson, Richard M.; Malanowski, Stanislaw,
Handbook of the Thermodynamics of Organic Compounds, 1987, https://doi.org/10.1007/978-94-009-3173-2
. [all data]
Stull, 1947
Stull, Daniel R.,
Vapor Pressure of Pure Substances. Organic and Inorganic Compounds,
Ind. Eng. Chem., 1947, 39, 4, 517-540, https://doi.org/10.1021/ie50448a022
. [all data]
Farberov, Bondarenko, et al., 1984
Farberov, M.I.; Bondarenko, A.V.; Tsilyurik, T.V.; Srednev, S.S.; Shutova, I.A.,
Epoxidation of isobutene with organic hydroperoxides, and certain syntheses on this basis,
J. Anal. Chem. USSR, 1984, 57, 1915-1919. [all data]
McAlduff and Houk, 1977
McAlduff, E.J.; Houk, K.N.,
Photoelectron spectra of substituted oxiranes and thiiranes. Substituent effects on ionization potentials involving σ orbitals,
Can. J. Chem., 1977, 55, 318. [all data]