Benzenamine, 2,3,4,5-tetrafluoro-
- Formula: C6H3F4N
- Molecular weight: 165.0883
- IUPAC Standard InChIKey: BEECAQIHCYTZHC-UHFFFAOYSA-N
- CAS Registry Number: 5580-80-3
- Chemical structure:
View 3d structure (requires JavaScript / HTML 5) - Other names: Aniline, 2,3,4,5-tetrafluoro-; 2,3,4,5-Tetrafluoroaniline

Phase change data

Data compiled by: Robert L. Brown and Stephen E. Stein
Reduced pressure boiling point
Tboil (K) | Pressure (bar) | Reference |
---|---|---|
351.2 | 0.017 | Aldrich Chemical Company Inc., 1990 |

Gas phase ion energetics data

Data compiled by: Sharon G. Lias, John E. Bartmess, Joel F. Liebman, John L. Holmes, Rhoda D. Levin, and W. Gary Mallard
Ionization energy determinations
IE (eV) | Method | Reference | Comment |
---|---|---|---|
8.70 | PE | Furin, Sultanov, et al., 1987 | Vertical value |

References

Aldrich Chemical Company Inc., 1990
Aldrich Chemical Company Inc.,
Catalog Handbook of Fine Chemicals, Aldrich Chemical Company, Inc., Milwaukee WI, 1990, 1. [all data]
Furin, Sultanov, et al., 1987
Furin, G.G.; Sultanov, A.S.; Furlei, I.I.,
Photoelectronic spectra of fluorine-containing aromatic amines,
Dokl. Phys. Chem., 1987, 530. [all data]