Isopropenyl bromide
- Formula: C3H5Br
- Molecular weight: 120.976
- IUPAC Standard InChIKey: PHMRPWPDDRGGGF-UHFFFAOYSA-N
- CAS Registry Number: 557-93-7
- Chemical structure:
View 3d structure (requires JavaScript / HTML 5) - Other names: Propene, 2-bromo-; 1-Propene, 2-bromo-; α-Methylvinyl bromide; 2-Bromo-1-propene; 2-Bromopropene; 2-Bromopropylene; CH3CBr=CH2; Isopropylene bromide; NSC 87535

Phase change data

Data compiled by: Robert L. Brown and Stephen E. Stein
Quantity | Value | Units | Method | Reference | Comment |
---|---|---|---|---|---|
Tboil | 321.6 | K | N/A | Weast and Grasselli, 1989 | |
Tboil | 321. | K | N/A | American Tokyo Kasei, 1988 |

Reaction thermochemistry data

Data compiled by: Hussein Y. Afeefy, Joel F. Liebman, and Stephen E. Stein
Individual Reactions
By formula: C3H6Br2 = HBr + C3H5Br
Quantity | Value | Units | Method | Reference | Comment |
---|---|---|---|---|---|
ΔrH° | 64.9 | kJ/mol | Eqk | Levanova, Rodova, et al., 1983 | liquid phase; Flow reactor |
ΔrH° | 69.9 ± 0.8 | kJ/mol | Eqk | Sharonov and Rozhnov, 1971 | gas phase |
By formula: C3H6BrCl = C3H5Br + HCl
Quantity | Value | Units | Method | Reference | Comment |
---|---|---|---|---|---|
ΔrH° | 64.9 | kJ/mol | Eqk | Levanova, Rodova, et al., 1983 | liquid phase; Flow reactor |
By formula: C3H6BrCl = C3H5Br + HCl
Quantity | Value | Units | Method | Reference | Comment |
---|---|---|---|---|---|
ΔrH° | 62.6 | kJ/mol | Eqk | Levanova, Rodova, et al., 1983 | liquid phase; Flow reactor |
By formula: C3H6Br2 = HBr + C3H5Br
Quantity | Value | Units | Method | Reference | Comment |
---|---|---|---|---|---|
ΔrH° | 63.6 | kJ/mol | Eqk | Levanova, Rodova, et al., 1983 | liquid phase; Flow reactor |

Gas phase ion energetics data

Data compiled as indicated in comments:
LLK - Sharon G. Lias, Rhoda D. Levin, and Sherif A. Kafafi
LBLHLM - Sharon G. Lias, John E. Bartmess, Joel F. Liebman, John L. Holmes, Rhoda D. Levin, and W. Gary Mallard
Ionization energy determinations
IE (eV) | Method | Reference | Comment |
---|---|---|---|
9.58 ± 0.02 | PE | Chadwick, Frost, et al., 1972 | Vertical value; LLK |
Appearance energy determinations
Ion | AE (eV) | Other Products | Method | Reference | Comment |
---|---|---|---|---|---|
C3H5+ | 10.8 ± 0.1 | Br | EI | Burgers, Holmes, et al., 1983 | LBLHLM |

References

Weast and Grasselli, 1989
CRC Handbook of Data on Organic Compounds, 2nd Editon, Weast,R.C and Grasselli, J.G., ed(s)., CRC Press, Inc., Boca Raton, FL, 1989, 1. [all data]
American Tokyo Kasei, 1988
American Tokyo Kasei,
TCI American Organic Chemical 88/89 Catalog, American Tokyo Kasei, Portland, OR, 1988, 1610. [all data]
Levanova, Rodova, et al., 1983
Levanova, S.V.; Rodova, R.M.; Tereshkina, T.P.; Zabrodina, T.I.,
Thermocatalytic reactions of bromochloropropanes,
Russ. J. Phys. Chem. (Engl. Transl.), 1983, 57, 1142-1146. [all data]
Sharonov and Rozhnov, 1971
Sharonov, K.G.; Rozhnov, A.M.,
Dehydrobromination of 2,2-dibromopropane,
Izv. Vyssh. Uchebn. Zaved., Khim. Khim. Tekhnol., 1971, 14, 389-393. [all data]
Chadwick, Frost, et al., 1972
Chadwick, D.; Frost, D.C.; Katrib, A.; McDowell, C.A.; McLean, R.A.N.,
Photoelectron spectra of some bromoethylenes and 2-bromopropene,
Can. J. Chem., 1972, 50, 2642. [all data]
Burgers, Holmes, et al., 1983
Burgers, P.C.; Holmes, J.L.; Mommers, A.A.; Szulejko, J.E.,
The collisionally induced dissociation of allyl and 2-propenyl cations,
Org. Mass Spectrom., 1983, 18, 596. [all data]